1-Butanamine, N,N-dibutyl-, compound with bromine(1:1)

Gas phase ion energetics data

Data compiled by: Sharon G. Lias, Rhoda D. Levin, and Sherif A. Kafafi

Ionization energy determinations

IE (eV) Method Reference Comment
10.66PEUtsunomiya, Kobayashi, et al., 1976Vertical value

References

Utsunomiya, Kobayashi, et al., 1976
Utsunomiya, C.; Kobayashi, T.; Nagakura, S., Photoelectron spectra of electron donor-acceptor complexes between bromine and alkylamines, Chem. Phys. Lett., 1976, 39, 245. [all data]