Silane, ethoxytriethyl-

Phase change data

Data compiled by: Robert L. Brown and Stephen E. Stein

Quantity Value Units Method Reference Comment
Tboil427. - 428.KN/APCR Inc., 1990

Kovats' RI, non-polar column, isothermal

View large format table.

Column type Active phase Temperature (C) I Reference Comment
PackedApiezon M160.901.Peetre, Ellren, et al., 1985Chromosorb G; Column length: 3. m

References

PCR Inc., 1990
PCR Inc., Research Chemicals Catalog 1990-1991, PCR Inc., Gainesville, FL, 1990, 1. [all data]

Peetre, Ellren, et al., 1985
Peetre, I.-B.; Ellren, O.; Smith, B.E.F., Gas chromatographic investigation of organometallic compounds and their carbon analogues. VI. Determination, calculation and correlation of Kováts retention indices for alkylalkoxysilanes, J. Chromatogr., 1985, 318, 41-55, https://doi.org/10.1016/S0021-9673(01)90662-4 . [all data]