Rubidium tetraphenyl boron

Condensed phase thermochemistry data

Data compiled by: Eugene S. Domalski and Elizabeth D. Hearing

Quantity Value Units Method Reference Comment
solid,1 bar106.30cal/mol*KN/ADavies and Staveley, 1957

Constant pressure heat capacity of solid

Cp,solid (cal/mol*K) Temperature (K) Reference Comment
98.700298.15Davies and Staveley, 1957T = 20 to 298 K.

References

Davies and Staveley, 1957
Davies, T.; Staveley, L.A.K., The behaviour of the ammonium ion in the ammonium salt of tetraphenylboron by comparison of the heat capacities of the ammonium, rubidium, and potassium salts, Trans. Faraday Soc., 1957, 53, 19-30. [all data]