1-Naphthalenepropanol, α-ethenyldecahydro-α,5,5,8a-tetramethyl-2-methylene-, [1S-[1α(S*),4aβ,8aα]]-

Kovats' RI, non-polar column, temperature ramp

View large format table.

Column type Active phase I Reference Comment
CapillaryDB-52055.Adams, González Elizondo, et al., 200630. m/0.26 mm/0.25 μm, He, 3. K/min; Tstart: 60. C; Tend: 246. C
CapillaryDB-52057.Barbosa, Paula, et al., 200530. m/0.25 mm/0.25 μm, He, 3. K/min, 240. C @ 15. min; Tstart: 60. C
CapillaryHP-52056.Mita, Tsitsimpikou, et al., 200230. m/0.25 mm/0.25 μm, He, 3. K/min, 240. C @ 20. min; Tstart: 60. C
CapillarySE-542055.Adams, 200030. m/0.26 mm/0.25 μm, He, 3. K/min; Tstart: 60. C; Tend: 246. C
CapillarySE-542056.Adams, 2000, 230. m/0.26 mm/0.25 μm, 3. K/min; Tstart: 60. C; Tend: 246. C
CapillaryDB-52054.Adams, 2000, 330. m/0.26 mm/0.25 μm, He, 3. K/min; Tstart: 60. C; Tend: 246. C

Kovats' RI, non-polar column, custom temperature program

View large format table.

Column type Active phase I Reference Comment
CapillaryCP Sil 8 CB2057.Radusiene, Judzentiene, et al., 200550. m/0.32 mm/0.25 μm, He; Program: 60C(1min) => 3C/min => 70C => 15C/min => 170C(8min) => 5C/min => 250C

Van Den Dool and Kratz RI, non-polar column, temperature ramp

View large format table.

Column type Active phase I Reference Comment
CapillarySPB-12087.Radulovic, Lazarevic, et al., 200730. m/0.25 mm/0.25 μm, He, 50. C @ 3. min, 5. K/min, 250. C @ 15. min
CapillaryHP-5MS2055.Radulovic, Lazarevic, et al., 200730. m/0.25 mm/0.25 μm, He, 60. C @ 5. min, 4. K/min; Tend: 280. C
CapillaryDB-52048.Rout, Rao, et al., 200725. m/0.25 mm/0.25 μm, He, 2. K/min, 200. C @ 60. min; Tstart: 60. C
CapillaryBP-12046.Duquesnoy, Dinh, et al., 200650. m/0.22 mm/0.25 μm, He, 2. K/min, 220. C @ 20. min; Tstart: 60. C
CapillaryBP-12048.Gonny, Cavaleiro, et al., 200650. m/0.22 mm/0.25 μm, He, 2. K/min, 220. C @ 20. min; Tstart: 60. C
CapillaryHP-52055.Javidnia, Miri, et al., 2005He, 3. K/min; Column length: 30. m; Column diameter: 0.25 mm; Tstart: 60. C; Tend: 260. C
CapillaryDB-52057.Adams, Habte, et al., 200430. m/0.26 mm/0.25 μm, He, 3. K/min; Tstart: 60. C; Tend: 246. C
CapillaryHP-5MS2056.Demetzos, Angelopoulou, et al., 200230. m/0.25 mm/0.25 μm, 50. C @ 5. min, 3. K/min; Tend: 280. C
CapillaryHP-52033.Pitarokili, Couladis, et al., 200230. m/0.25 mm/0.25 μm, He, 3. K/min; Tstart: 60. C; Tend: 280. C
CapillaryHP-52055.Couladis, Tzakou, et al., 200130. m/0.25 mm/0.50 μm, He, 3. K/min; Tstart: 60. C; Tend: 280. C
CapillaryRTX-5 MS2065.Hudaib, Grazia Bellardi, et al., 200130. m/0.25 mm/0.25 μm, He, 70. C @ 10. min, 4. K/min, 210. C @ 10. min
CapillaryRTX-5 MS2080.Hudaib, Grazia Bellardi, et al., 200130. m/0.25 mm/0.25 μm, He, 70. C @ 10. min, 4. K/min, 210. C @ 10. min
CapillaryHP-52057.Lazari, Skaltsa, et al., 200030. m/0.25 mm/0.25 μm, He, 50. C @ 5. min, 4. K/min; Tend: 280. C

Van Den Dool and Kratz RI, non-polar column, custom temperature program

View large format table.

Column type Active phase I Reference Comment
Capillary5 % Phenyl methyl siloxane2057.Sacchetti, Maietti, et al., 200530. m/0.32 mm/0.15 μm, He; Program: 45C => 1C/min => 100C => 5C/min => 250C (10min)
CapillaryHP-52050.García, Alvarez, et al., 200250. m/0.2 mm/0.33 μm, He; Program: 50C(2min) => 5C/min => 150C => 10C/min => 250C(30min)

Normal alkane RI, non-polar column, temperature ramp

View large format table.

Column type Active phase I Reference Comment
CapillaryHP-12056.Alizadeh and Shaabani, 201230. m/0.25 mm/0.25 μm, Helium, 3. K/min; Tstart: 60. C; Tend: 240. C
CapillaryHP-52048.Velickovic, Ristic, et al., 201225. m/0.32 mm/0.52 μm, Hydrogen, 4. K/min, 280. C @ 10. min; Tstart: 40. C
CapillaryHP-52048.Velickovic, Ristic, et al., 201225. m/0.32 mm/0.52 μm, Hydrogen, 4. K/min, 280. C @ 10. min; Tstart: 40. C
CapillaryHP-52048.Velickovic, Ristic, et al., 201225. m/0.32 mm/0.52 μm, Hydrogen, 4. K/min, 280. C @ 10. min; Tstart: 40. C
CapillaryCP-Sil 5 CB2072.Mothana, Hasson, et al., 201130. m/0.25 mm/0.26 μm, Nitrogen, 3. K/min, 280. C @ 22. min; Tstart: 45. C
CapillaryHP-52050.Bousaada, Ammar, et al., 200830. m/0.25 mm/0.25 μm, Nitrogen, 50. C @ 1. min, 5. K/min, 280. C @ 1. min
CapillaryHP-52055.Saidana, Mahjoub, et al., 200830. m/0.25 mm/0.25 μm, Nitrogen, 50. C @ 1. min, 5. K/min, 280. C @ 1. min
CapillaryCP Sil 5 CB2051.Baran, von Reuss, et al., 200730. m/0.32 mm/0.25 μm, N2, 4. K/min; Tstart: 60. C; Tend: 300. C
CapillarySPB-12026.Pinto, Salgueiro, et al., 200730. m/0.2 mm/0.2 μm, He, 3. K/min, 220. C @ 15. min; Tstart: 70. C
CapillaryHP-5MS2057.Vichi, Riu-Aumatell, et al., 200730. m/0.25 mm/0.25 μm, He, 40. C @ 5. min, 3. K/min, 250. C @ 10. min
CapillaryHP-5MS2027.Pitarokili, Tzakou, et al., 200630. m/0.25 mm/0.25 μm, He, 3. K/min; Tstart: 60. C; Tend: 280. C
CapillaryHP-5MS2057.Petrakis, Roussis, et al., 20053. K/min; Column length: 30. m; Column diameter: 0.2 mm; Tstart: 60. C; Tend: 280. C
CapillaryHP-5 MS2057.Urdampilleta, Amat, et al., 200530. m/0.25 mm/0.25 μm, Helium, 3. K/min; Tstart: 60. C; Tend: 240. C
CapillaryDB-12027.Velasco-Negueruela, Pérez-Alonso, et al., 200550. m/0.25 mm/0.25 μm, 3. K/min; Tstart: 60. C; Tend: 240. C
CapillaryRTX-5Sil2068.Dudai, Larkov, et al., 200330. m/0.25 mm/0.25 μm, He, 4. K/min, 200. C @ 10. min; Tstart: 70. C
CapillaryHP-52052.Pitarokili, Tzakou, et al., 200330. m/0.25 mm/0.25 μm, He, 3. K/min; Tstart: 60. C; Tend: 280. C
CapillaryHP-52050.Velickovic, Randjelovic, et al., 200325. m/0.32 mm/0.53 μm, H2, 4. K/min; Tstart: 40. C; Tend: 280. C
CapillaryHP-52057.Velickovic, Randjelovic, et al., 200325. m/0.32 mm/0.53 μm, H2, 4. K/min; Tstart: 40. C; Tend: 280. C
CapillaryHP-52048.Velickovic, Ristic, et al., 200325. m/0.32 mm/0.53 μm, Helium, 4. K/min; Tstart: 40. C; Tend: 280. C
CapillaryHP-52057.Velickovic, Ristic, et al., 200325. m/0.32 mm/0.53 μm, Helium, 4. K/min; Tstart: 40. C; Tend: 280. C
CapillaryDB-52070.Krauze-Baranowska, Mardarowicz, et al., 200230. m/0.25 mm/0.25 μm, He, 35. C @ 2. min, 3. K/min, 280. C @ 15. min
CapillaryHP-52056.Velickovic, Randjelovic, et al., 200230. m/0.25 mm/0.25 μm, H2, 4. K/min; Tstart: 40. C; Tend: 280. C
CapillaryDB-52063.Santos-Gomes and Fernandes-Ferreira, 200130. m/0.25 mm/0.25 μm, H2, 3. K/min; Tstart: 60. C; Tend: 285. C
CapillaryDB-52065.Zoghbi, Andrade, et al., 199930. m/0.25 mm/0.25 μm, He, 3. K/min; Tstart: 60. C; Tend: 240. C
CapillaryDB-12042.Perry, Baxter, et al., 198610. m/0.25 mm/0.25 μm, H2, 5. K/min; Tstart: 50. C; Tend: 250. C

Normal alkane RI, non-polar column, custom temperature program

View large format table.

Column type Active phase I Reference Comment
CapillaryTR-5 MS2047.Kurashov, Mitrukova, et al., 201415. m/0.25 mm/0.25 μm, Helium; Program: 35 0C (3 min) 2 0C/min -> 60 0C (3 min) 2 0C/min -> 80 0C (3 min) 4 0C/min -> 120 0C (3 min) 5 0C/min -> 150 0C (3 min) 15 0C/min -> 240 0C (10 min)
CapillaryTR-5 MS2067.Kurashov, Krylova, et al., 201315. m/0.25 mm/0.25 μm, Helium; Program: 35 0C (3 min) 2 0C/min -> 60 0C (3 min) 2 0C/min -> 80 0C (3 min) 4 0C/min -> 120 0C (3 min) 5 0C/min -> 150 0C (3 mion) 15 0C/min -> 240 0C (10 min)
CapillaryHP-52057.Velickovic, Ristic, et al., 201225. m/0.32 mm/0.52 μm, Hydrogen; Program: not specified
CapillaryDB-52056.Yusuf and Bewaji, 2011Helium; Column length: 30. m; Column diameter: 0.32 mm; Program: not specified
CapillaryHP-52063.Vichi, Aumatell, et al., 200830. m/0.25 mm/0.25 μm, Helium; Program: 130 0C 5 0C/min -> 240 0C 15 0C/min -> 320 0C (10 min)
CapillaryHP-5MS2052.Deng, Xu, et al., 200630. m/0.25 mm/0.25 μm, He; Program: 50C(2min) => 6C/min => 200C => 10C/min => 270C(10min)
CapillaryCP Sil 8 CB2056.Mockute, Nivinskiene, et al., 200350. m/0.32 mm/0.25 μm, He; Program: 60C(1min) => 5C/min => 160C => 10C/min => 250C(5min)
CapillaryDB-52053.Pichette, Garneau, et al., 1998Column length: 30. m; Column diameter: 0.25 mm; Program: 60 0C (2 min) 2 0C/min -> 140 0C 1 0C/min -> 190 0C 2 0C/min -> 210 0C (28 min)

References

Adams, González Elizondo, et al., 2006
Adams, R.P.; González Elizondo, M.S.; González Elizondo, M.; Slinkman, E., DNA fingerprinting and terpenoid analysis of Juniperus blancoi var. huehuentensis (Cupressaceae), a new subalpine variety from Durango, Mexico, Biochem. Syst. Ecol., 2006, 34, 3, 205-211, https://doi.org/10.1016/j.bse.2005.11.004 . [all data]

Barbosa, Paula, et al., 2005
Barbosa, L.C.A.; Paula, V.F.; Azevedo, A.S.; Silva, E.A.M.; Nascimento, E.A., Essential oil composition from some plant parts of Conyza bonariensis (L.) Cronquist, Flavour Fragr. J., 2005, 20, 1, 39-41, https://doi.org/10.1002/ffj.1392 . [all data]

Mita, Tsitsimpikou, et al., 2002
Mita, E.; Tsitsimpikou, C.; Tsiveleka, L.; Petrakis, P.V.; Ortiz, A.; Vagias, C.; Roussis, V., Seasonal Variation of Oleoresin Terpenoids from Pinus halepensis and Pinus pinea and Host Selection of the Scale Insect Marchalina hellenica (Homoptera, Coccoidea, Margarodidae, Coelostonidiinae), Holzforschung, 2002, 56, 6, 572-578, https://doi.org/10.1515/HF.2002.087 . [all data]

Adams, 2000
Adams, R.P., Systematics of smooth leaf margin Juniperus of the western hemisphere based on leaf essential oils and RAPD DNA fingerprinting, Biochem. Syst. Ecol., 2000, 28, 2, 149-162, https://doi.org/10.1016/S0305-1978(99)00047-2 . [all data]

Adams, 2000, 2
Adams, R.P., Systematics of the one seeded Juniperus of the eastern hemisphere based on leaf essential oils and random amplified polymorphic DNAs (RAPDs), Biochem. Syst. Ecol., 2000, 28, 6, 529-543, https://doi.org/10.1016/S0305-1978(99)00096-4 . [all data]

Adams, 2000, 3
Adams, R.P., The serrate leaf margined Juniperus (Section Sabina) of the western hemisphere: systematics and evolution based on leaf essential oils and Random Amplified Polymorphic DNAs (RAPDs), Biochem. Syst. Ecol., 2000, 28, 10, 975-989, https://doi.org/10.1016/S0305-1978(00)00022-3 . [all data]

Radusiene, Judzentiene, et al., 2005
Radusiene, J.; Judzentiene, A.; Bernotiene, G., Essential oil composition and variability of Hypericum perforatum L. growing in Lithuania, Biochem. Syst. Ecol., 2005, 33, 2, 113-124, https://doi.org/10.1016/j.bse.2004.06.010 . [all data]

Radulovic, Lazarevic, et al., 2007
Radulovic, N.; Lazarevic, J.; Ristic, N.; Palic, R., Chemotaxonomic significance of the volatiles in the genus Stachys (Lamiaceae): Essential oil composition of four Balkan Stachys species, Biochem. Syst. Ecol., 2007, 35, 4, 196-208, https://doi.org/10.1016/j.bse.2006.10.010 . [all data]

Rout, Rao, et al., 2007
Rout, P.K.; Rao, Y.R.; Sree., A.; Naik, S.N., Composition of essential oil, concrete, absolute, wax and headspace volatiles of Murrarya paniculata (Linn.) Jack flowers, Flavour Fragr. J., 2007, 22, 5, 352-357, https://doi.org/10.1002/ffj.1804 . [all data]

Duquesnoy, Dinh, et al., 2006
Duquesnoy, E.; Dinh, N.H.; Castola, V.; Casanova, J., Composition of a Pyrolytic oil from Cupressus funebris Endl. of Vietnamese origin, Flavour Fragr. J., 2006, 21, 3, 453-457, https://doi.org/10.1002/ffj.1676 . [all data]

Gonny, Cavaleiro, et al., 2006
Gonny, M.; Cavaleiro, C.; Salgueiro, L.; Casanova, J., Analysis of Juniperus communis subsp. alpina needle, berry, wood and root oils by combination of GC, GC/MS and 13C-NMR, Flavour Fragr. J., 2006, 21, 1, 99-106, https://doi.org/10.1002/ffj.1527 . [all data]

Javidnia, Miri, et al., 2005
Javidnia, K.; Miri, R.; Jamalian, A., Composition of the essential oil of Salvia macrosiphon Boiss. from Iran, Flavour Fragr. J., 2005, 20, 5, 542-543, https://doi.org/10.1002/ffj.1468 . [all data]

Adams, Habte, et al., 2004
Adams, R.P.; Habte, M.; Park, S.; Dafforn, M.R., Preliminary comparison of vetiver root essential oils from cleansed (bacteria- and fungus-free) versus non-cleansed (normal) vetiver plants, Biochem. Syst. Ecol., 2004, 32, 12, 1137-1144, https://doi.org/10.1016/j.bse.2004.03.013 . [all data]

Demetzos, Angelopoulou, et al., 2002
Demetzos, C.; Angelopoulou, D.; Perdetzoglou, D., A comparative study of the essential oils of Cistus salviifolius in several populations of Crete (Greece), Biochem. Syst. Ecol., 2002, 30, 7, 651-665, https://doi.org/10.1016/S0305-1978(01)00145-4 . [all data]

Pitarokili, Couladis, et al., 2002
Pitarokili, D.; Couladis, M.; Petsikos-Panayotarou, N.; Tzakou, O., Composition and antifungal activity on soil-borne pathogens of the essential oil of Salvia sclarea from Greece, J. Agric. Food Chem., 2002, 50, 23, 6688-6691, https://doi.org/10.1021/jf020422n . [all data]

Couladis, Tzakou, et al., 2001
Couladis, M.; Tzakou, O.; Stojanovic, D.; Mimica-Dukic, N.; Jancic, R., The essential oil composition of Salvia argentea L., Flavour Fragr. J., 2001, 16, 3, 227-229, https://doi.org/10.1002/ffj.989 . [all data]

Hudaib, Grazia Bellardi, et al., 2001
Hudaib, M.; Grazia Bellardi, M.; Rubies-Autonell, C.; Fiori, J.; Cavrini, V., Chromatographic (GC-MS, HPLC) and virological evaluations of Salvia sclarea infected by BBWV-I, Farmaco, 2001, 56, 3, 219-227, https://doi.org/10.1016/S0014-827X(01)01038-2 . [all data]

Lazari, Skaltsa, et al., 2000
Lazari, D.M.; Skaltsa, H.D.; Constantinidis, T., Volatile constituents of Centaurea pelia DC., C. thessala Hausskn. subsp. drakiensis (Freyn Sint.) Georg. and C. zuccariniana DC. from Greece, Flavour Fragr. J., 2000, 15, 1, 7-11, https://doi.org/10.1002/(SICI)1099-1026(200001/02)15:1<7::AID-FFJ860>3.0.CO;2-3 . [all data]

Sacchetti, Maietti, et al., 2005
Sacchetti, G.; Maietti, S.; Muzzoli, M.; Scaglianti, M.; Manfredini, S.; Radice, M.; Bruni, R., Comparative evaluation of 11 essential oils of different origin as functional antioxidants, antiradicals and antimicrobials in foods, Food Chem., 2005, 91, 4, 621-632, https://doi.org/10.1016/j.foodchem.2004.06.031 . [all data]

García, Alvarez, et al., 2002
García, D.; Alvarez, A.; Tornos, P.; Fernandez, A.; Sáenz, T., Gas chromatographic-mass spectrometry study of the essential oils of Pimenta racemosa var. terebinthina and P. racemosa var. grisea, Z. Naturforsch., 2002, 57c, 449-451. [all data]

Alizadeh and Shaabani, 2012
Alizadeh, A.; Shaabani, M., Essential oil composition, phenolic content, antioxidant and antimicrobial activity in Salvia officinalis L. cultivated in Iran, Adv. Environ. Biol., 2012, 6, 1, 221-226. [all data]

Velickovic, Ristic, et al., 2012
Velickovic, D.T.; Ristic, M.S.; Karabegovic, I.T.; Stojicevic, S.S.; Lazic, M.L., The influence of the distillation method on the chemical composition of the essential oil of sage (Salvia officinalis L.), Advanced Technologies, 2012, 1, 1, 47-51. [all data]

Mothana, Hasson, et al., 2011
Mothana, R.A.A.; Hasson, S.S.; Schultze, W.; Mowitz, A.; Lindequist, U., Phytochemical composition and in vitro antimicrobial and antioxidant activities of essential oils of three endemic Soqotraen Boswellia species, Food Chem., 2011, 126, 3, 1149-1154, https://doi.org/10.1016/j.foodchem.2010.11.150 . [all data]

Bousaada, Ammar, et al., 2008
Bousaada, O.; Ammar, S.; Saidana, D.; Chriaa, J.; Chraif, I.; Daami, M.; Helal, A.N.; Mighri, Z., Chemical composition and antimicrobial activity of volatile components from capitula and aerial parts of Rhaponticum acaule DC growing wild in Tunisia, Microbiol. Res., 2008, 163, 1, 87-95, https://doi.org/10.1016/j.micres.2007.02.010 . [all data]

Saidana, Mahjoub, et al., 2008
Saidana, D.; Mahjoub, M.A.; Boussaada, O.; Chriaa, J.; Cheraif, I.; Daami, M.; Mighri, Z.; Helal, A.N., Chemical composition and antimicrobial activity of volatile compounds of Tamarix boveana (Tamaricaceae), Microbiol. Res., 2008, 163, 4, 445-455, https://doi.org/10.1016/j.micres.2006.07.009 . [all data]

Baran, von Reuss, et al., 2007
Baran, S.; von Reuss, S.H.; König, W.A.; Kalemba, D., Composition of the essential oil of Abies koreana Wils., Flavour Fragr. J., 2007, 22, 1, 78-83, https://doi.org/10.1002/ffj.1762 . [all data]

Pinto, Salgueiro, et al., 2007
Pinto, E.; Salgueiro, L.R.; Cavaleiro, C.; Palmeira, A.; Goncalves, M.J., In vitro susceptibility of some species of yeasts and filamentous fungi to essential oils of Salvia of?cinalis, Ind. Crops Prod., 2007, 26, 2, 135-141, https://doi.org/10.1016/j.indcrop.2007.02.004 . [all data]

Vichi, Riu-Aumatell, et al., 2007
Vichi, S.; Riu-Aumatell, M.; Mora-Pons, M.; Guadayol, J.M.; Buxaderas, S.; López-Tamames, E., Analytical, Nutritional and Clinical Methods. HS-SPME coupled to GC/MS for quality control of Juniperus communis L. berries used for gin aromatization, Food Chem., 2007, 105, 4, 1748-1754, https://doi.org/10.1016/j.foodchem.2007.03.026 . [all data]

Pitarokili, Tzakou, et al., 2006
Pitarokili, D.; Tzakou, O.; Loukis, A., Essential oil composition of Salvia verticillata, S. verbenaca, S. glutinosa and S. candidissima growing wild in Greece, Flavour Fragr. J., 2006, 21, 4, 670-673, https://doi.org/10.1002/ffj.1647 . [all data]

Petrakis, Roussis, et al., 2005
Petrakis, P.V.; Roussis, V.; Papadimitriou, D.; Vagias, C.; Tsitsimpikou, C., The effect of terpenoid extracts from 15 pine species on the feeding behavioural sequence of the late instars of the pine processionary caterpillar Thaumetopoea pityocampa, Behav. Processes, 2005, 69, 3, 303-322, https://doi.org/10.1016/j.beproc.2004.12.008 . [all data]

Urdampilleta, Amat, et al., 2005
Urdampilleta, J.D.; Amat, A.G.; Bidau, C.J.; Koslobsky, N.K., Biosystematic and chemosystematic studies in five South Americal species of Conyza (Asteraceae), Bol. Soc. Argent. Bot., 2005, 40, 1-2, 101-107. [all data]

Velasco-Negueruela, Pérez-Alonso, et al., 2005
Velasco-Negueruela, A.; Pérez-Alonso, M.J.; Palá-Paúl, J.; Iñigo, A.; López, G., The volatile oil composition of the berries of Juniperus macrocarpa Sibth. and Sm., gathered in Spain, J. Essent. Oil Res., 2005, 17, 1, 61-63, https://doi.org/10.1080/10412905.2005.9698831 . [all data]

Dudai, Larkov, et al., 2003
Dudai, N.; Larkov, O.; Chaimovitsh, D.; Lewinsohn, E.; Freiman, L.; Ravid, U., Essential oil compounds of Origanum dayi Post, Flavour Fragr. J., 2003, 18, 4, 334-337, https://doi.org/10.1002/ffj.1237 . [all data]

Pitarokili, Tzakou, et al., 2003
Pitarokili, D.; Tzakou, O.; Loukis, A.; Harvala, C., Volatile metabolites from Salvia fruticosa as antifungal agents in soilborne pathogens, J. Agric. Food Chem., 2003, 51, 11, 3294-3301, https://doi.org/10.1021/jf0211534 . [all data]

Velickovic, Randjelovic, et al., 2003
Velickovic, D.T.; Randjelovic, N.V.; Ristic, M.S.; Velickovic, A.S.; Smelcerovic, A.A., Chemical constituents and antimicrobial activity of the ethanol extracts obtained from the flower, leaf, and stem of Salvia officinalis L., J. Serb. Chem. Soc., 2003, 68, 1, 17-24, https://doi.org/10.2298/JSC0301017V . [all data]

Velickovic, Ristic, et al., 2003
Velickovic, A.S.; Ristic, M.S.; Velickovic, D.T.; Ilic, S.; Mitic, N.D., The possibilities of the application of some species of sage (Salvia L.) as auxiliaries in the treatment of some diseases, J. Serb. Chem. Soc., 2003, 68, 6, 435-445, https://doi.org/10.2298/JSC0306435V . [all data]

Krauze-Baranowska, Mardarowicz, et al., 2002
Krauze-Baranowska, M.; Mardarowicz, M.; Wiwart, M.; Poblocka, L.; Dynowska, M., Antifungal activity of the essential oils from some species of the genus Pinus, Z. Naturforsch., 2002, 57c, 478-482. [all data]

Velickovic, Randjelovic, et al., 2002
Velickovic, D.T.; Randjelovic, N.V.; Ristic, M.S.; Smelcerovic, A.A.; Velickovic, A.S., Chemical composition and antimicrobial action of the ethanol extracts of Salvia pratensis L., Salvia glutinosa L. and Salvia aethiopis L., J. Serb. Chem. Soc., 2002, 67, 10, 639-646, https://doi.org/10.2298/JSC0210639V . [all data]

Santos-Gomes and Fernandes-Ferreira, 2001
Santos-Gomes, P.C.; Fernandes-Ferreira, M., Organ- and season-dependent variation in the essential oil composition of Salvia officinalis L. cultivated at two different sites, J. Agric. Food Chem., 2001, 49, 6, 2908-2916, https://doi.org/10.1021/jf001102b . [all data]

Zoghbi, Andrade, et al., 1999
Zoghbi, M.G.B.; Andrade, E.H.A.; Maia, J.G.S., The essential oil of Vitex angus-castus L. growing in the Amazon region, Flavour Fragr. J., 1999, 14, 4, 211-213, https://doi.org/10.1002/(SICI)1099-1026(199907/08)14:4<211::AID-FFJ812>3.0.CO;2-W . [all data]

Perry, Baxter, et al., 1986
Perry, N.B.; Baxter, A.J.; Brennan, N.J.; van Klink, J.W., Dalmatian Sage. PArt 1. Differing oil yields and compositions from flowering and non-flowering accessions, Flavour Fragr. J., 1986, 11, 4, 231-238, https://doi.org/10.1002/(SICI)1099-1026(199607)11:4<231::AID-FFJ572>3.0.CO;2-0 . [all data]

Kurashov, Mitrukova, et al., 2014
Kurashov, E.A.; Mitrukova, G.G.; Krylova, Yu.V., Variations in the component composition of essential oil of Ceratophyllum demersum (Ceratophyllaceae) during vegetation (in press), Plant Resources (Rastitel'nye Resursy), 2014, 1, 000-000. [all data]

Kurashov, Krylova, et al., 2013
Kurashov, E.A.; Krylova, Yu.V.; Mitrukova, G.G., Variations in component composition of essential oil of Potamogeton pusillus (Potamogetonaceae) dirong vegetation, Plant Resources (Rastitel'nye Resursy), 2013, 000-000. [all data]

Yusuf and Bewaji, 2011
Yusuf, O.K.; Bewaji, C.O., GC-MS of volatile components of fermented wheat germ extract, J. Cereals Oilseeds, 2011, 2, 3, 38-42. [all data]

Vichi, Aumatell, et al., 2008
Vichi, S.; Aumatell, M.R.; Buxaderas, S.; Lopez-Tamames, E., Assessment of some diterpenoids in commercial distilled gin, Anal. Chim. Acta, 2008, 628, 2, 222-229, https://doi.org/10.1016/j.aca.2008.09.005 . [all data]

Deng, Xu, et al., 2006
Deng, C.; Xu, X.; Yao, N.; Li, N.; Zhang, X., Rapid determination of essential oil compounds in Artemisia Selengensis Turcz by gas chromatography-mass spectrometry with microwave distillation and simultaneous solid-phase microextraction, Anal. Chim. Acta., 2006, 556, 2, 289-294, https://doi.org/10.1016/j.aca.2005.09.038 . [all data]

Mockute, Nivinskiene, et al., 2003
Mockute, D.; Nivinskiene, O.; Bernotiene, G.; Butkiene, R., The cis-thujone chemotype of Salvia officinalis L. essential oils, Chemija, 2003, 14, 4, 216-220. [all data]

Pichette, Garneau, et al., 1998
Pichette, A.; Garneau, F.-X.; Jean, F.-I.; Riedl, B.; Girarg, M., Chemical differences between the wood extracts pf Jack pine (pinus banksiana(. blacj spruce (Picea mariana) and balsam for (Abies balsamea) from eastern Canada, J. Wood Chem. Technol., 1998, 18, 4, 427-438, https://doi.org/10.1080/02773819809349590 . [all data]