1H-Naphtho[2,1-b]pyran, 3-ethenyldodecahydro-3,4a,7,7,10a-pentamethyl-, [3R-(3α,4aβ,6aα,10aβ,10bα)]-

Normal alkane RI, polar column, temperature ramp

Data compiled by: NIST Mass Spectrometry Data Center, William E. Wallace, director

Column type CapillaryCapillaryCapillaryCapillaryCapillary
Active phase TC-FFAPSupelcowax 10HP-20MHP Innowax FSPInnowax
Column length (m)  30.50.60.60.
Carrier gas HeHeliumHeHeHe
Substrate
Column diameter (mm) 0.250.200.20.250.25
Phase thickness (μm) 0.250.200.20.250.25
Tstart (C) 60.70.70.60.60.
Tend (C) 220.220.180.220.220.
Heat rate (K/min) 3.3.4.
Initial hold (min)   4.10.10.
Final hold (min) 30.15.10.10.
I 2340.2339.2358.2376.2376.
ReferenceKurose, Okamura, et al., 2007Cavaleiro, Pinto, et al., 2006Mastelic and Jerkovic, 2003Kaya, Baser, et al., 1999Kaya, Baser, et al., 1999, 2
Comment MSDC-RI MSDC-RI MSDC-RI MSDC-RI MSDC-RI
Column type Capillary
Active phase HP-Innowax
Column length (m) 60.
Carrier gas He
Substrate
Column diameter (mm) 0.25
Phase thickness (μm) 0.25
Tstart (C) 60.
Tend (C) 220.
Heat rate (K/min)
Initial hold (min) 10.
Final hold (min)
I 2376.
ReferenceKaya, Baser, et al., 1999, 3
Comment MSDC-RI

Van Den Dool and Kratz RI, polar column, temperature ramp

Data compiled by: NIST Mass Spectrometry Data Center, William E. Wallace, director

Column type CapillaryCapillaryCapillaryCapillaryCapillary
Active phase BP-20RTX-WaxBP-20BP-20BP-20
Column length (m) 50.60.50.50.50.
Carrier gas HeHeHeHeHe
Substrate
Column diameter (mm) 0.220.220.220.220.22
Phase thickness (μm) 0.250.250.250.250.25
Tstart (C) 60.60.60.60.60.
Tend (C) 220.230.220.220.220.
Heat rate (K/min) 2.2.2.2.2.
Initial hold (min)
Final hold (min) 20.35.20.20.20.
I 2346.2335.2347.2348.2341.
ReferenceDuquesnoy, Castola, et al., 2007Paolini, Muselli, et al., 2007Boti, Bighelli, et al., 2006Duquesnoy, Dinh, et al., 2006Rezzi, Bighelli, et al., 2001
Comment MSDC-RI MSDC-RI MSDC-RI MSDC-RI MSDC-RI
Column type Capillary
Active phase BP-20
Column length (m) 50.
Carrier gas He
Substrate
Column diameter (mm) 0.22
Phase thickness (μm) 0.25
Tstart (C) 60.
Tend (C) 230.
Heat rate (K/min) 2.
Initial hold (min)
Final hold (min) 35.
I 2345.
ReferenceMariotti, Costa, et al., 1997
Comment MSDC-RI

References

Kurose, Okamura, et al., 2007
Kurose, K.; Okamura, D.; Yatagai, M., Composition of the essential oils from the leaves of nine Pinus species and the cones of three of Pinus species, Flavour Fragr. J., 2007, 22, 1, 10-20, https://doi.org/10.1002/ffj.1609 . [all data]

Cavaleiro, Pinto, et al., 2006
Cavaleiro, C.; Pinto, E.; Gonsales, M.J.; Salguero, L., Antifungal activity of Juniperus essential oils agains dermatophyte, Asrgillus and Candida strains, J. Appl. Microbiol., 2006, 100, 6, 1333-1338, https://doi.org/10.1111/j.1365-2672.2006.02862.x . [all data]

Mastelic and Jerkovic, 2003
Mastelic, J.; Jerkovic, I., Application of co-distillation with superheated pentane vapour to the isolation of unstable essential oils, Flavour Fragr. J., 2003, 18, 6, 521-526, https://doi.org/10.1002/ffj.1261 . [all data]

Kaya, Baser, et al., 1999
Kaya, A.; Baser, K.H.C.; Koca, F., Essential oils of Acinos troodi (Post) Leblebici subsp. vardaranus Leblebici and subsp. grandiflorus Hartvig Strid, Flavour Fragr. J., 1999, 14, 1, 50-54, https://doi.org/10.1002/(SICI)1099-1026(199901/02)14:1<50::AID-FFJ783>3.0.CO;2-7 . [all data]

Kaya, Baser, et al., 1999, 2
Kaya, A.; Baser, K.H.C.; Demirci, B.; Koca, F., The essential oil of Acinos alpinus (L.) Moench growing in Turkey, Flavour Fragr. J., 1999, 14, 1, 55-59, https://doi.org/10.1002/(SICI)1099-1026(199901/02)14:1<55::AID-FFJ784>3.0.CO;2-Q . [all data]

Kaya, Baser, et al., 1999, 3
Kaya, A.; Baser, K.H.C.; Tümen, G.; Koca, F., The essential oil of Acinos suaveolens (Sm.) G. Don fil. Acinos arvensis (Lam.) Dandy and Acinos rotundifolius Pers. growing wild in Turkey, Flavour Fragr. J., 1999, 14, 1, 60-64, https://doi.org/10.1002/(SICI)1099-1026(199901/02)14:1<60::AID-FFJ785>3.0.CO;2-0 . [all data]