Aluminum, di-μ-iodotetramethyldi-

Gas phase ion energetics data

Data compiled by: Sharon G. Lias, Rhoda D. Levin, and Sherif A. Kafafi

Ionization energy determinations

IE (eV) Method Reference Comment
9.38PELappert, Pedley, et al., 1976Vertical value

References

Lappert, Pedley, et al., 1976
Lappert, M.F.; Pedley, J.B.; Sharp, G.J.; Guest, M.F., Bonding studies of compounds of boron and elements of groups 3-5, J. Chem. Soc. Faraday Trans. 2, 1976, 72, 539. [all data]