Naphthalene, decahydro-1,1,4a-trimethyl-6-methylene-5-(3-methyl-2,4-pentadienyl)-, [4aS-(4aα,5α,8aβ)]-

Kovats' RI, non-polar column, isothermal

View large format table.

Column type Active phase Temperature (C) I Reference Comment
CapillarySE-30170.1962.Perry and Weavers, 1984
CapillarySE-30190.1979.Perry and Weavers, 1984
CapillarySE-30170.1985.Perry and Weavers, 1984
CapillarySE-30190.2004.Perry and Weavers, 1984

Kovats' RI, polar column, isothermal

View large format table.

Column type Active phase Temperature (C) I Reference Comment
CapillaryCarbowax 20M190.2330.Perry and Weavers, 1984
CapillaryCarbowax 20M170.2344.Perry and Weavers, 1984
CapillaryCarbowax 20M190.2370.Perry and Weavers, 1984

Normal alkane RI, non-polar column, custom temperature program

View large format table.

Column type Active phase I Reference Comment
CapillaryTR-5 MS1931.Kurashov, Krylova, et al., 201315. m/0.25 mm/0.25 μm, Helium; Program: 35 0C (3 min) 2 0C/min -> 60 0C (3 min) 2 0C/min -> 80 0C (3 min) 4 0C/min -> 120 0C (3 min) 5 0C/min -> 150 0C (3 mion) 15 0C/min -> 240 0C (10 min)

References

Perry and Weavers, 1984
Perry, N.B.; Weavers, R.T., Kovats indices of diterpene hydrocarbons on fused-silica capillary columns, J. Chromatogr., 1984, 284, 478-481, https://doi.org/10.1016/S0021-9673(01)87850-X . [all data]

Kurashov, Krylova, et al., 2013
Kurashov, E.A.; Krylova, Yu.V.; Mitrukova, G.G., Variations in component composition of essential oil of Potamogeton pusillus (Potamogetonaceae) dirong vegetation, Plant Resources (Rastitel'nye Resursy), 2013, 000-000. [all data]