(3R,5aS,9aR)-2,2,5a,9-Tetramethyl-3,4,5,5a,6,7-hexahydro-2H-3,9a-methanobenzo[b]oxepine

Van Den Dool and Kratz RI, non-polar column, custom temperature program

Data compiled by: NIST Mass Spectrometry Data Center, William E. Wallace, director

Column type Capillary
Active phase HP-5MS
Column length (m) 30.
Carrier gas He
Substrate
Column diameter (mm) 0.25
Phase thickness (μm) 0.25
Program 60C (1 min) => 5 C/min => 210C => 10 C/min => 280C (15 min)
I 1556.1
ReferenceAndriamaharavo, 2014
Comment MSDC-RI

Van Den Dool and Kratz RI, non-polar column, temperature ramp

Data compiled by: NIST Mass Spectrometry Data Center, William E. Wallace, director

Column type CapillaryCapillaryCapillaryCapillary
Active phase RTX-1HP-5RTX-1HP-5
Column length (m) 60.30.60.30.
Carrier gas  HeHeHe
Substrate
Column diameter (mm) 0.220.250.220.25
Phase thickness (μm) 0.250.250.250.25
Tstart (C) 60.40.60.40.
Tend (C) 220.250.230.240.
Heat rate (K/min) 2.3.2.3.
Initial hold (min)
Final hold (min) 20. 45.
I 1536.1543.1535.1546.
ReferenceCozzani, Muselli, et al., 2005Isidorov, Krajewska, et al., 2004Cavalli, Tomi, et al., 2003Shellie and Marriott, 2003
Comment MSDC-RI MSDC-RI MSDC-RI MSDC-RI

Normal alkane RI, non-polar column, custom temperature program

Data compiled by: NIST Mass Spectrometry Data Center, William E. Wallace, director

Column type Capillary
Active phase CP Sil 5 CB
Column length (m) 25.
Carrier gas
Substrate
Column diameter (mm)
Phase thickness (μm)
Program not specified
I 1540.
ReferenceWeyerstahl, Marschall, et al., 2000
Comment MSDC-RI

References

Andriamaharavo, 2014
Andriamaharavo, N.R., Retention Data. NIST Mass Spectrometry Data Center., NIST Mass Spectrometry Data Center, 2014. [all data]