Butanoic acid, 2,2-dimethyl-

Phase change data

Data compiled as indicated in comments:
BS - Robert L. Brown and Stephen E. Stein
TRC - Thermodynamics Research Center, NIST Boulder Laboratories, Chris Muzny director
AC - William E. Acree, Jr., James S. Chickos

Quantity Value Units Method Reference Comment
Tboil450. ± 50.KAVGN/AAverage of 15 values; Individual data points
Quantity Value Units Method Reference Comment
Tfus258.15KN/ATimmermans, 1952Uncertainty assigned by TRC = 0.5 K; TRC

Reduced pressure boiling point

Tboil (K) Pressure (bar) Reference Comment
368.20.007Aldrich Chemical Company Inc., 1990BS

Enthalpy of vaporization

ΔvapH (kJ/mol) Temperature (K) Method Reference Comment
59.4 ± 0.3370.EBSteele, Chirico, et al., 2002Based on data from 364. - 498. K.; AC
54.6 ± 0.3410.EBSteele, Chirico, et al., 2002Based on data from 364. - 498. K.; AC
50.0 ± 0.4450.EBSteele, Chirico, et al., 2002Based on data from 364. - 498. K.; AC
46.0 ± 0.7490.EBSteele, Chirico, et al., 2002Based on data from 364. - 498. K.; AC

In addition to the Thermodynamics Research Center (TRC) data available from this site, much more physical and chemical property data is available from the following TRC products:

References

Timmermans, 1952
Timmermans, J., Freezing points of organic compounds. VVI New determinations., Bull. Soc. Chim. Belg., 1952, 61, 393. [all data]

Aldrich Chemical Company Inc., 1990
Aldrich Chemical Company Inc., Catalog Handbook of Fine Chemicals, Aldrich Chemical Company, Inc., Milwaukee WI, 1990, 1. [all data]

Steele, Chirico, et al., 2002
Steele, W.V.; Chirico, R.D.; Knipmeyer, S.E.; Nguyen, A., Vapor Pressure, Heat Capacity, and Density along the Saturation Line: Measurements for Benzenamine, Butylbenzene, sec -Butylbenzene, tert -Butylbenzene, 2,2-Dimethylbutanoic Acid, Tridecafluoroheptanoic Acid, 2-Butyl-2-ethyl-1,3-propanediol, 2,2,4-Trimethyl-1,3-pentanediol, and 1-Chloro-2-propanol, J. Chem. Eng. Data, 2002, 47, 4, 648-666, https://doi.org/10.1021/je010083e . [all data]