3-Oxabicyclo[3.2.1]octane-2,4-dione, 1,8,8-trimethyl-, (1S)-

Phase change data

Data compiled by: William E. Acree, Jr., James S. Chickos

Enthalpy of fusion

ΔfusH (kJ/mol) Temperature (K) Method Reference
5.65493.6DSCWeinstein, Leffler, et al., 1984
8.7495.DSCMjojo, 1979

References

Weinstein, Leffler, et al., 1984
Weinstein, D.I.; Leffler, A.J.; Currie, J.A., Phase Transitions In Bicyclic Compounds, Molecular Crystals and Liquid Crystals, 1984, 104, 1-2, 95-109, https://doi.org/10.1080/00268948408070401 . [all data]

Mjojo, 1979
Mjojo, Chodziwadziwa C., Order?disorder phenomena. Part 2.?Order?disorder phase equilibria in D- and L-systems of camphor and related compounds, J. Chem. Soc., Faraday Trans. 2, 1979, 75, 692, https://doi.org/10.1039/f29797500692 . [all data]