Phenol, 4-chloro-3-methyl-

Lee's RI, non-polar column, temperature ramp

Data compiled by: NIST Mass Spectrometry Data Center, William E. Wallace, director

Column type CapillaryCapillary
Active phase DB-5DB-5
Column length (m) 30.30.
Carrier gas HeHe
Substrate
Column diameter (mm) 0.320.26
Phase thickness (μm) 0.250.25
Tstart (C) 40.50.
Tend (C) 285.300.
Heat rate (K/min) 8.6.
Initial hold (min) 3.4.
Final hold (min) 29.520.
I 218.5220.20
ReferenceDonnelly, Abdel-Hamid, et al., 1993Rostad and Pereira, 1986
Comment MSDC-RI MSDC-RI

References

Donnelly, Abdel-Hamid, et al., 1993
Donnelly, J.R.; Abdel-Hamid, M.S.; Jeter, J.L.; Gurka, D.F., Application of gas chromatographic retention properties to the identification of environmental contaminants, J. Chromatogr., 1993, 642, 1-2, 409-415, https://doi.org/10.1016/0021-9673(93)80106-I . [all data]

Rostad and Pereira, 1986
Rostad, C.E.; Pereira, W.E., Kovats and Lee retention indices determined by gas chromatography/mass spectrometry for organic compounds of environmental interest, J. Hi. Res. Chromatogr. Chromatogr. Comm., 1986, 9, 6, 328-334, https://doi.org/10.1002/jhrc.1240090603 . [all data]