1,2,3-Propanetricarboxylic acid, 2-hydroxy-, hydrate (1:1)

Phase change data

Data compiled by: Eugene S. Domalski and Elizabeth D. Hearing

Enthalpy of phase transition

ΔHtrs (kJ/mol) Temperature (K) Initial Phase Final Phase Reference Comment
14.980312.1crystaline, IIcrystaline, IDe Kruif, Van Miltenburg, et al., 1982

Entropy of phase transition

ΔStrs (J/mol*K) Temperature (K) Initial Phase Final Phase Reference Comment
48.0312.1crystaline, IIcrystaline, IDe Kruif, Van Miltenburg, et al., 1982

Condensed phase thermochemistry data

Data compiled as indicated in comments:
ALS - Hussein Y. Afeefy, Joel F. Liebman, and Stephen E. Stein
DH - Eugene S. Domalski and Elizabeth D. Hearing

Quantity Value Units Method Reference Comment
Δfsolid-439.2kcal/molCcbChappel and Hoare, 1958ALS
Quantity Value Units Method Reference Comment
Δcsolid-466.6kcal/molCcbChappel and Hoare, 1958Corresponding Δfsolid = -439.3 kcal/mol (simple calculation by NIST; no Washburn corrections); ALS
Quantity Value Units Method Reference Comment
solid,1 bar67.76cal/mol*KN/AEvans, Hoare, et al., 1962DH
solid,1 bar68.193cal/mol*KN/ADe Kruif, Van Miltenburg, et al., 1982DH

Constant pressure heat capacity of solid

Cp,solid (cal/mol*K) Temperature (K) Reference Comment
64.417300.De Kruif, Van Miltenburg, et al., 1982T = 120 to 300 K.; DH
64.08298.15Evans, Hoare, et al., 1962T = 21 to 303 K.; DH

References

De Kruif, Van Miltenburg, et al., 1982
De Kruif, C.G.; Van Miltenburg, J.C.; Sprenkels, A.J.J.; Stevens, G., Thermodynamic properties of citric acid and the system citric acid-water, Thermochim. Acta, 1982, 58, 341-354. [all data]