Propane, 2-chloro-2-nitro-

Phase change data

Data compiled as indicated in comments:
TRC - Thermodynamics Research Center, NIST Boulder Laboratories, Chris Muzny director
AC - William E. Acree, Jr., James S. Chickos
CAL - James S. Chickos, William E. Acree, Jr., Joel F. Liebman, Students of Chem 202 (Introduction to the Literature of Chemistry), University of Missouri -- St. Louis
DH - Eugene S. Domalski and Elizabeth D. Hearing

Quantity Value Units Method Reference Comment
Tfus251.6KN/ACrowe and Smyth, 1950Crystal phase 1 phase; Uncertainty assigned by TRC = 0.1 K; TRC

Enthalpy of fusion

ΔfusH (kJ/mol) Temperature (K) Reference Comment
1.34261.6Domalski and Hearing, 1996AC

Entropy of fusion

ΔfusS (J/mol*K) Temperature (K) Reference Comment
44.62213.8Domalski and Hearing, 1996CAL
5.1261.6

Enthalpy of phase transition

ΔHtrs (kJ/mol) Temperature (K) Initial Phase Final Phase Reference Comment
9.540213.8crystaline, IIcrystaline, ICrowe and Smyth, 1950, 2DH
1.340251.6crystaline, IliquidCrowe and Smyth, 1950, 2DH

Entropy of phase transition

ΔStrs (J/mol*K) Temperature (K) Initial Phase Final Phase Reference Comment
44.6213.8crystaline, IIcrystaline, ICrowe and Smyth, 1950, 2DH
5.3251.6crystaline, IliquidCrowe and Smyth, 1950, 2DH

In addition to the Thermodynamics Research Center (TRC) data available from this site, much more physical and chemical property data is available from the following TRC products:

References

Crowe and Smyth, 1950
Crowe, R.W.; Smyth, C.P., Heat capacities, dielectric constants and molecular rotational freedom in solid trichloroethanes and disubstituted propanes, J. Am. Chem. Soc., 1950, 72, 4009. [all data]

Domalski and Hearing, 1996
Domalski, Eugene S.; Hearing, Elizabeth D., Heat Capacities and Entropies of Organic Compounds in the Condensed Phase. Volume III, J. Phys. Chem. Ref. Data, 1996, 25, 1, 1, https://doi.org/10.1063/1.555985 . [all data]

Crowe and Smyth, 1950, 2
Crowe, R.W.; Smyth, C.P., Heat capacities, dielectric constants and molecular rotational freedom in solid trichloroethanes and disubstituted propanes, J. Am. Chem. Soc., 1950, 72, 4009-4015. [all data]