Procaine

Normal alkane RI, non-polar column, custom temperature program

Data compiled by: NIST Mass Spectrometry Data Center, William E. Wallace, director

Column type CapillaryCapillaryCapillaryCapillaryCapillary
Active phase Polymethylsiloxane, (PMS-20000)Polydimethyl siloxanesBP-1BP-1CP Sil 5 CB
Column length (m) 12. 12.12.25.
Carrier gas He HeHeHelium
Substrate
Column diameter (mm) 0.20 0.220.220.32
Phase thickness (μm) 0.33 0.250.250.48
Program not specifiednot specified120 0X 8 0C/min -> 270 0C 25 0C/min -> 300 0C (5 min)not specified60 0C (2.5 min) 30 0C/min -> 190 0C 7 0C/min -> 295 9C (7 min)
I 1979.2017.1991.1995.2018.
ReferenceGambaro, Saligari, et al., 1997Zenkevich and Chupalov, 1996Stowell and Wilson, 1985Stowell and Wilson, 1985Bogusz, Wijsbeek, et al., 1983
Comment MSDC-RI MSDC-RI MSDC-RI MSDC-RI MSDC-RI
Column type PackedOther
Active phase SE-30Methyl Silicone
Column length (m)
Carrier gas
Substrate
Column diameter (mm)
Phase thickness (μm)
Program not specifiednot specified
I 2010.2018.
ReferenceBogusz, Wijsbeek, et al., 1983Ardrey and Moffat, 1981
Comment MSDC-RI MSDC-RI

Normal alkane RI, non-polar column, temperature ramp

Data compiled by: NIST Mass Spectrometry Data Center, William E. Wallace, director

Column type PackedCapillaryCapillaryCapillaryPacked
Active phase SE-30Polymethylsiloxane, (PMS-20000)BP-1BP-1SE-30
Column length (m) 2.12.12.12.2.
Carrier gas NitrogenHeHeHe
Substrate Chromosorb G AW DMCS (80-100 mesh)   Gas Chrom P
Column diameter (mm)  0.200.220.22
Phase thickness (μm)  0.330.250.25
Tstart (C) 100.160.100.50.120.
Tend (C) 300.300.295.300.200.
Heat rate (K/min)  10.5.20.2.5
Initial hold (min)
Final hold (min)
I 2018.2010.1978.1990.2025.
ReferenceMHA, 9999Gambaro, Saligari, et al., 1997Stowell and Wilson, 1985Stowell and Wilson, 1985Marozzi, Gambaro, et al., 1982
Comment MSDC-RI MSDC-RI MSDC-RI MSDC-RI MSDC-RI

Van Den Dool and Kratz RI, non-polar column, custom temperature program

Data compiled by: NIST Mass Spectrometry Data Center, William E. Wallace, director

Column type Capillary
Active phase BP-1
Column length (m) 12.
Carrier gas He
Substrate
Column diameter (mm) 0.22
Phase thickness (μm) 0.25
Program 120C => 8C/min => 270C => 25C/min => 300C
I 1991.
ReferenceStowell and Wilson, 1987
Comment MSDC-RI

References

Gambaro, Saligari, et al., 1997
Gambaro, V.; Saligari, E.; Froldi, R.; Bianchi, L., Analysis of street drugs by means of HRGC, Bollettino Chimico Farmaceutica, 1997, 36, 4, 359-367. [all data]

Zenkevich and Chupalov, 1996
Zenkevich, I.G.; Chupalov, A.A., New Possibilities of Chromato Mass Pectrometric Identification of Organic Compounds Using Increments of Gas Chromatographic Retention Indices of Molecular Structural Fragments, Zh. Org. Khim. (Rus.), 1996, 32, 5, 656-666. [all data]

Stowell and Wilson, 1985
Stowell, A.; Wilson, L., Use of retention indices in drug screening by capillary gas chromatography, Rep. # CD 2362, Department of Scientific and Industrial Reseach, Chemistry Division, Lower Hutt, NZ, 1985, 32. [all data]

Bogusz, Wijsbeek, et al., 1983
Bogusz, M.; Wijsbeek, J.; Franke, J.P.; de Zeeuw, R.A., Applicability of capillary gas chromatography to systematic toxicological analysis: occurence of concentration-dependent retention behavior, J. Analyt. Toxicol., 1983, 7, 4, 188-192, https://doi.org/10.1093/jat/7.4.188 . [all data]

Ardrey and Moffat, 1981
Ardrey, R.E.; Moffat, A.C., Gas-liquid chromatographic retention indices of 1318 substances of toxicological interest on SE-30 or OV-1 stationary phase, J. Chromatogr., 1981, 220, 3, 195-252, https://doi.org/10.1016/S0021-9673(00)81925-1 . [all data]