3-Acetamidofuran

Normal alkane RI, non-polar column, temperature ramp

View large format table.

Column type Active phase I Reference Comment
CapillaryDB-11202.Chen, Wang, et al., 199860. m/0.32 mm/1. μm, He, 3. K/min; Tstart: 40. C; Tend: 260. C

References

Chen, Wang, et al., 1998
Chen, J.; Wang, M.; Ho, C.-T., Volatile compounds generated from thermal degradation of N-acetylglucosamine, J. Agric. Food Chem., 1998, 46, 8, 3207-3209, https://doi.org/10.1021/jf980129g . [all data]