Ethyl methyl sulphone

Gas phase thermochemistry data

Data compiled by: Hussein Y. Afeefy, Joel F. Liebman, and Stephen E. Stein

Quantity Value Units Method Reference Comment
Δfgas-408. ± 3.kJ/molCcrBusfield, Mackle, et al., 1961Heat of combustion corrected for constant pressure

Condensed phase thermochemistry data

Data compiled by: Hussein Y. Afeefy, Joel F. Liebman, and Stephen E. Stein

Quantity Value Units Method Reference Comment
Δfliquid-486.39 ± 0.71kJ/molCcrBusfield, Mackle, et al., 1961Reanalyzed by Cox and Pilcher, 1970, Original value = -486.01 ± 0.71 kJ/mol; Heat of combustion corrected for constant pressure
Quantity Value Units Method Reference Comment
Δcliquid-2439.8 ± 0.50kJ/molCcrBusfield, Mackle, et al., 1961Heat of combustion corrected for constant pressure

References

Busfield, Mackle, et al., 1961
Busfield, W.K.; Mackle, H.; O'Hare, P.A.G., Studies in the thermochemistry of sulphones. Part 2 - The standard heats of formation of sulphones of the type RSO2CH3, Trans. Faraday Soc., 1961, 57, 1054-1057. [all data]

Cox and Pilcher, 1970
Cox, J.D.; Pilcher, G., Thermochemistry of Organic and Organometallic Compounds, Academic Press, New York, 1970, 1-636. [all data]