2-Butanamine, 2-methyl-

Phase change data

Data compiled as indicated in comments:
BS - Robert L. Brown and Stephen E. Stein
TRC - Thermodynamics Research Center, NIST Boulder Laboratories, Chris Muzny director

Quantity Value Units Method Reference Comment
Tboil350.2KN/AWeast and Grasselli, 1989BS
Tboil350.KN/AAmerican Tokyo Kasei, 1988BS
Tboil350.65KN/ABrown and Jones, 1946Uncertainty assigned by TRC = 3. K; TRC
Tboil350.05KN/ATimmermans and Mattaar, 1921Uncertainty assigned by TRC = 0.3 K; TRC
Tboil352.15KN/AWischnegradsky, 1874Uncertainty assigned by TRC = 5. K; TRC
Quantity Value Units Method Reference Comment
Tfus168.15KN/ATimmermans and Mattaar, 1921Uncertainty assigned by TRC = 0.6 K; TRC

In addition to the Thermodynamics Research Center (TRC) data available from this site, much more physical and chemical property data is available from the following TRC products:

References

Weast and Grasselli, 1989
CRC Handbook of Data on Organic Compounds, 2nd Editon, Weast,R.C and Grasselli, J.G., ed(s)., CRC Press, Inc., Boca Raton, FL, 1989, 1. [all data]

American Tokyo Kasei, 1988
American Tokyo Kasei, TCI American Organic Chemical 88/89 Catalog, American Tokyo Kasei, Portland, OR, 1988, 1610. [all data]

Brown and Jones, 1946
Brown, R.; Jones, W.E., J. Chem. Soc., 1946, 1946, 781. [all data]

Timmermans and Mattaar, 1921
Timmermans, J.; Mattaar, J.F., Freezing points of orgainic substances VI. New experimental determinations., Bull. Soc. Chim. Belg., 1921, 30, 213. [all data]

Wischnegradsky, 1874
Wischnegradsky, A., Justus Liebigs Ann. Chem., 1874, 174, 56. [all data]