Propane, 2,2-dibromo-

Phase change data

Data compiled by: Robert L. Brown and Stephen E. Stein

Reduced pressure boiling point

Tboil (K) Pressure (bar) Reference
387.70.987Weast and Grasselli, 1989

Reaction thermochemistry data

Data compiled by: Hussein Y. Afeefy, Joel F. Liebman, and Stephen E. Stein

Individual Reactions

Propane, 2,2-dibromo- = Hydrogen bromide + Isopropenyl bromide

By formula: C3H6Br2 = HBr + C3H5Br

Quantity Value Units Method Reference Comment
Δr64.9kJ/molEqkLevanova, Rodova, et al., 1983liquid phase; Flow reactor
Δr69.9 ± 0.8kJ/molEqkSharonov and Rozhnov, 1971gas phase

22-bromo-2-chloropropane = Propane, 2,2-dibromo- + Propane, 2,2-dichloro-

By formula: 2C3H6BrCl = C3H6Br2 + C3H6Cl2

Quantity Value Units Method Reference Comment
Δr-1.3kJ/molEqkLevanova, Rodova, et al., 1983liquid phase; Flow reactor

Normal alkane RI, non-polar column, isothermal

View large format table.

Column type Active phase Temperature (C) I Reference Comment
CapillaryApiezon L130.771.Arruda, Junkes, et al., 2008

References

Weast and Grasselli, 1989
CRC Handbook of Data on Organic Compounds, 2nd Editon, Weast,R.C and Grasselli, J.G., ed(s)., CRC Press, Inc., Boca Raton, FL, 1989, 1. [all data]

Levanova, Rodova, et al., 1983
Levanova, S.V.; Rodova, R.M.; Tereshkina, T.P.; Zabrodina, T.I., Thermocatalytic reactions of bromochloropropanes, Russ. J. Phys. Chem. (Engl. Transl.), 1983, 57, 1142-1146. [all data]

Sharonov and Rozhnov, 1971
Sharonov, K.G.; Rozhnov, A.M., Dehydrobromination of 2,2-dibromopropane, Izv. Vyssh. Uchebn. Zaved., Khim. Khim. Tekhnol., 1971, 14, 389-393. [all data]

Arruda, Junkes, et al., 2008
Arruda, A.C.S.; Junkes, B. da.S.; Souza, E.S.; Yunes, R.A.; Heizen, V.E.F., Semi-Emlirical Topological Index to Predict Properties of Halogenated Aliphatic Compounds, J. Chemometrics, 2008, 22, 3-4, 186-194, https://doi.org/10.1002/cem.1121 . [all data]