Acetamide, N-1,3-butadienyl-2,2,2-trichloro-, (E)-

Gas phase ion energetics data

Data compiled by: Sharon G. Lias, Rhoda D. Levin, and Sherif A. Kafafi

Ionization energy determinations

IE (eV) Method Reference Comment
8.66PEOverman, Taylor, et al., 1978Vertical value

References

Overman, Taylor, et al., 1978
Overman, L.E.; Taylor, G.F.; Houk, K.N.; Domelsmith, L.N., Diels-Alder reactions between trans-1-N-acylamino-1,3-dienes and methyl acrylate. A correlation between diene photoelectron ionization potentials and reactivity, stereoselectivity, and regioselectivity, J. Am. Chem. Soc., 1978, 100, 3182. [all data]