Borane, trimethyl-

Phase change data

Data compiled as indicated in comments:
TRC - Thermodynamics Research Center, NIST Boulder Laboratories, Chris Muzny director
AC - William E. Acree, Jr., James S. Chickos

Quantity Value Units Method Reference Comment
Ttriple113.21KN/AFurukawa and Park, 1954Uncertainty assigned by TRC = 0.02 K; TRC

Enthalpy of fusion

ΔfusH (kJ/mol) Temperature (K) Reference Comment
3.25113.2Domalski and Hearing, 1996AC

In addition to the Thermodynamics Research Center (TRC) data available from this site, much more physical and chemical property data is available from the following TRC products:

Reaction thermochemistry data

Data compiled as indicated in comments:
B - John E. Bartmess
M - Michael M. Meot-Ner (Mautner) and Sharon G. Lias

Individual Reactions

Fluorine anion + Borane, trimethyl- = (Fluorine anion • Borane, trimethyl-)

By formula: F- + C3H9B = (F- • C3H9B)

Quantity Value Units Method Reference Comment
Δr244.8kJ/molIMRBMurphy and Beauchamp, 1977gas phase; MeSiF3>Me3B>SF4; B
Δr197. ± 8.4kJ/molIMRELarson and McMahon, 1985gas phase; These relative affinities are ca. 10 kcal/mol weaker than threshold values (see Wenthold and Squires, 1995) for donors greater than ca. 27 kcal/mol in free energy. This discrepancy has not yet been resolved, though the stronger value appears preferable.; B,M
Quantity Value Units Method Reference Comment
Δr100.J/mol*KN/ALarson and McMahon, 1985gas phase; switching reaction,Thermochemical ladder(F-)H2O, Entropy change calculated or estimated; Arshadi, Yamdagni, et al., 1970; M
Quantity Value Units Method Reference Comment
Δr166. ± 8.4kJ/molIMRELarson and McMahon, 1985gas phase; These relative affinities are ca. 10 kcal/mol weaker than threshold values (see Wenthold and Squires, 1995) for donors greater than ca. 27 kcal/mol in free energy. This discrepancy has not yet been resolved, though the stronger value appears preferable.; B,M

C3H8B- + Hydrogen cation = Borane, trimethyl-

By formula: C3H8B- + H+ = C3H9B

Quantity Value Units Method Reference Comment
Δr1532. ± 26.kJ/molG+TSMurphy and Beauchamp, 1976gas phase; Between AsH3,PH3; value altered from reference due to change in acidity scale; B
Quantity Value Units Method Reference Comment
Δr1502. ± 25.kJ/molIMRBMurphy and Beauchamp, 1976gas phase; Between AsH3,PH3; value altered from reference due to change in acidity scale; B

References

Furukawa and Park, 1954
Furukawa, G.T.; Park, R.P., Heat Capacity, Heats of Fusion, Transition, and Vaporization, and Vapor Pressure of Trimethylborane B(CH3)3, Natl. Bur. Stand., 1954. [all data]

Domalski and Hearing, 1996
Domalski, Eugene S.; Hearing, Elizabeth D., Heat Capacities and Entropies of Organic Compounds in the Condensed Phase. Volume III, J. Phys. Chem. Ref. Data, 1996, 25, 1, 1, https://doi.org/10.1063/1.555985 . [all data]

Murphy and Beauchamp, 1977
Murphy, M.K.; Beauchamp, J.L., Fluorine and Alkyl Substituent Effects on Gas-Phase Lewis Acidities of Boranes by ICR Spectroscopy, Inorg. Chem., 1977, 16, 2437. [all data]

Larson and McMahon, 1985
Larson, J.W.; McMahon, T.B., Fluoride and chloride affinities of the main group oxides, fluorides, oxofluorides, and alkyls. Quantitative scales of lewis acidities from ICR halide exchange equilibria, J. Am. Chem. Soc., 1985, 107, 766. [all data]

Wenthold and Squires, 1995
Wenthold, P.G.; Squires, R.R., Bond dissociation energies of F2(-) and HF2(-). A gas-phase experimental and G2 theoretical study, J. Phys. Chem., 1995, 99, 7, 2002, https://doi.org/10.1021/j100007a034 . [all data]

Arshadi, Yamdagni, et al., 1970
Arshadi, M.; Yamdagni, R.; Kebarle, P., Hydration of Halide Negative Ions in the Gas Phase. II. Comparison of Hydration Energies for the Alkali Positive and Halide Negative Ions, J. Phys. Chem., 1970, 74, 7, 1475, https://doi.org/10.1021/j100702a014 . [all data]

Murphy and Beauchamp, 1976
Murphy, M.K.; Beauchamp, J.L., Acid-base properties and gas-phase ion chemistry of (CH3)3B, J. Am. Chem. Soc., 1976, 98, 1433. [all data]