z-Diazene, bis(bicyclo[2.2.1]hept-1-yl)-

Reaction thermochemistry data

Data compiled by: Hussein Y. Afeefy, Joel F. Liebman, and Stephen E. Stein

Individual Reactions

C14H22N2 = C14H22N2

By formula: C14H22N2 = C14H22N2

Quantity Value Units Method Reference Comment
Δr-67.9 ± 3.8kJ/molKinSchmittel and Ruchardt, 1987solid phase; solvent: Mesitylene
Δr-81. ± 2.kJ/molEqkSchmittel, Schultz, et al., 1981liquid phase; solvent: Dimethyl formamide
Δr-79. ± 2.kJ/molEqkSchmittel, Schultz, et al., 1981liquid phase; solvent: Dodecane

References

Schmittel and Ruchardt, 1987
Schmittel, M.; Ruchardt, C., Stereoisomerization and homolytic decomposition of cis and trans bridgehead diazenes, J. Am. Chem. Soc., 1987, 109, 2750-2759. [all data]

Schmittel, Schultz, et al., 1981
Schmittel, M.; Schultz, A.; Ruchardt, C.; Hadicke, E., Aliphatic azo compounds. XIII. cis- and trans-1-Azonorbornane, Chem. Ber., 1981, 114, 3533-3548. [all data]