τ-Cadinol

Kovats' RI, non-polar column, temperature ramp

Data compiled by: NIST Mass Spectrometry Data Center, William E. Wallace, director

Column type CapillaryCapillaryCapillaryCapillaryCapillary
Active phase DB-5HP-5MSHP-1DB-1BP-1
Column length (m) 30.30.60.25.25.
Carrier gas HeHeHeHeN2
Substrate
Column diameter (mm) 0.260.250.250.20.32
Phase thickness (μm) 0.250.250.25 0.25
Tstart (C) 60.60.60.60.60.
Tend (C) 246.280.200.220.220.
Heat rate (K/min) 3.2.4.3.5.
Initial hold (min)  8.5.3.
Final hold (min)  30.25. 13.
I 1640.1639.1648.1632.1625.
ReferenceAdams, González Elizondo, et al., 2006Hazzit, Baaliouamer, et al., 2006Meccia G., Rosquete C., et al., 2006Mevy, Bessiere, et al., 2006Raina, Verma, et al., 2006
Comment MSDC-RI MSDC-RI MSDC-RI MSDC-RI MSDC-RI
Column type CapillaryCapillaryCapillaryCapillaryCapillary
Active phase DB-5CP Sil 8 CBCP Sil 8 CBDB-5DB-5
Column length (m) 30.30.30.30.30.
Carrier gas  H2H2HeHe
Substrate
Column diameter (mm) 0.250.250.250.260.26
Phase thickness (μm) 0.250.250.250.250.25
Tstart (C) 40.50.50.60.60.
Tend (C) 210.220.220.246.246.
Heat rate (K/min) 2.3.3.3.3.
Initial hold (min) 2.2.2.
Final hold (min) 33.
I 1638.1635.1635.1640.1640.
ReferenceSylvestre, Pichette, et al., 2006Tayoub, Schwob, et al., 2006Tayoub, Schwob, et al., 2006, 2Adams, Morris, et al., 2005Adams and Nguyen, 2005
Comment MSDC-RI MSDC-RI MSDC-RI MSDC-RI MSDC-RI
Column type CapillaryCapillaryCapillaryCapillaryCapillary
Active phase BP-5DB-5CP Sil 5 CBDB-5MSHP-5MS
Column length (m) 50.30.25.30.30.
Carrier gas HeH2H2HeHe
Substrate
Column diameter (mm) 0.320.250.250.250.32
Phase thickness (μm) 0.250.250.150.250.25
Tstart (C) 50.40.50.60.70.
Tend (C) 260.280.230.240.250.
Heat rate (K/min) 5.4.3.3.3.
Initial hold (min) 2.   5.
Final hold (min) 5.30.
I 1649.1639.1638.1640.1644.
ReferenceBaranauskiene, Venskutonis, et al., 2005Avato, Raffo, et al., 2004Ogunwande, Olawore, et al., 2004Palmeira, Moura, et al., 2004Siani, Garrido, et al., 2004
Comment MSDC-RI MSDC-RI MSDC-RI MSDC-RI MSDC-RI
Column type CapillaryCapillaryCapillaryCapillaryCapillary
Active phase DB-5HP-5MSDB-5CP Sil 5 CBDB-5
Column length (m) 25.30.30.25.30.
Carrier gas HeHeHeHeHe
Substrate
Column diameter (mm) 0.250.250.250.250.25
Phase thickness (μm)  0.250.250.150.25
Tstart (C) 40.50.60.50.50.
Tend (C) 280.280. 230.250.
Heat rate (K/min) 3.4.3.3.0.5
Initial hold (min) 5.2.  5.
Final hold (min) 5.10.  10.
I 1625.1649.1639.1628.1648.
ReferenceAmparo Blázquez, Pérez, et al., 2003Baranauskiene, Venskutonis, et al., 2003Lucero, Estell, et al., 2003Ogunwande, Olawore, et al., 2003Viña and Murillo, 2003
Comment MSDC-RI MSDC-RI MSDC-RI MSDC-RI MSDC-RI
Column type CapillaryCapillaryCapillaryCapillaryCapillary
Active phase SPB-1HP-5BP-1BP-1BP-1
Column length (m) 30.30.60.25.25.
Carrier gas HeHeN2N2N2
Substrate
Column diameter (mm) 0.320.250.320.320.55
Phase thickness (μm) 0.250.250.250.250.25
Tstart (C) 60.60.60.60.60.
Tend (C) 225.240.220.220.220.
Heat rate (K/min) 2.3.5.5.5.
Initial hold (min) 2.
Final hold (min) 5.20. 15.15.
I 1611.1640.1625.1624.1624.
ReferenceJayaprakasha, Rao, et al., 2002Mita, Tsitsimpikou, et al., 2002Raina, Lal, et al., 2002Raina, Srivastava, et al., 2002Raina, Srivastava, et al., 2002, 2
Comment MSDC-RI MSDC-RI MSDC-RI MSDC-RI MSDC-RI
Column type CapillaryCapillaryCapillaryCapillaryCapillary
Active phase BP-1PTE-5BP-1BP-1DB-1
Column length (m) 30.60.25.25.50.
Carrier gas N2H2N2N2N2
Substrate
Column diameter (mm) 0.320.320.550.550.25
Phase thickness (μm) 0.250.390.250.250.25
Tstart (C) 60.60.60.60.80.
Tend (C) 220.285.220.220.225.
Heat rate (K/min) 5.4.35.5.4.
Initial hold (min)
Final hold (min) 13. 15.15.
I 1622.1642.1624.1616.1627.
ReferenceShawl, Srivastava, et al., 2002Gudzic, Dordevic, et al., 2001Jain, Aggarwal, et al., 2001Jain, Srivastava, et al., 2001Palá-Paúl, Velasco-Negueruela, et al., 2001
Comment MSDC-RI MSDC-RI MSDC-RI MSDC-RI MSDC-RI
Column type CapillaryCapillaryCapillaryCapillaryCapillary
Active phase HP-1BP-1DB-1SE-54DB-5
Column length (m) 50.25.30.30.30.
Carrier gas HeN2HeHeHe
Substrate
Column diameter (mm) 0.250.550.250.260.26
Phase thickness (μm) 0.250.250.250.250.25
Tstart (C) 100.60.40.60.60.
Tend (C) 250.220.260.246.240.
Heat rate (K/min) 5.5.2.3.3.
Initial hold (min) 7. 5.
Final hold (min)  15.20.
I 1626.1624.1615.1640.1640.
ReferenceRaina, Srivastava, et al., 2001Raina, Srivastava, et al., 2001, 2Senatore and Rigano, 2001Adams, 2000Adams, 2000, 2
Comment MSDC-RI MSDC-RI MSDC-RI MSDC-RI MSDC-RI
Column type CapillaryCapillaryCapillaryCapillaryCapillary
Active phase SE-54DB-5HP-5MSDB-5DB-5
Column length (m) 30.30.30.30.30.
Carrier gas  HeHe He
Substrate
Column diameter (mm) 0.260.260.250.320.26
Phase thickness (μm) 0.250.250.25 0.25
Tstart (C) 60.60.60.50.60.
Tend (C) 246.246.280.250.246.
Heat rate (K/min) 3.3.3.3.3.
Initial hold (min)    5.
Final hold (min)
I 1640.1640.1640.1648.1640.
ReferenceAdams, 2000, 3Adams, 2000, 4Roussis, Tsoukatou, et al., 2000Tzakou, Harvala, et al., 2000Adams, 1999
Comment MSDC-RI MSDC-RI MSDC-RI MSDC-RI MSDC-RI
Column type CapillaryCapillaryCapillaryCapillaryCapillary
Active phase DB-5HP-5MSDB-5DB-5DB-5
Column length (m) 30.30.30.30.30.
Carrier gas HeHeHeHeHe
Substrate
Column diameter (mm) 0.250.320.250.250.25
Phase thickness (μm) 0.330.250.250.250.25
Tstart (C) 40.70.60.60.40.
Tend (C) 260.250.240.240.250.
Heat rate (K/min) 2.3.3.4.2.
Initial hold (min) 5.5.  5.
Final hold (min) 20.   20.
I 1625.1635.1644.1643.1625.
ReferenceSenatore and de Feo, 1999Siani, Ramos, et al., 1999da Silva, Andrade, et al., 1999da Silva, Zoghbi, et al., 1999Senatore, Urrunaga Soria, et al., 1998
Comment MSDC-RI MSDC-RI MSDC-RI MSDC-RI MSDC-RI
Column type CapillaryCapillaryCapillaryCapillaryCapillary
Active phase DB-5SPB-1DB-5DB-5DB-5
Column length (m) 30.30.30.30.30.
Carrier gas HeHeHeHe
Substrate
Column diameter (mm) 0.250.320.250.25
Phase thickness (μm) 0.250.250.250.25
Tstart (C) 40.60.40.60.40.
Tend (C) 250.250.250.240.210.
Heat rate (K/min) 2.5.2.3.2.
Initial hold (min) 5.2.5. 2.
Final hold (min) 20.5.20. 120.
I 1625.1630.1614.1640.1636.
ReferenceSenatore, 1998Jayaprakasha, Jaganmohan Rao, et al., 1997Senatore, Urrunaga Soria, et al., 1997Tellez, Estell, et al., 1997Loayza, Abujder, et al., 1995
Comment MSDC-RI MSDC-RI MSDC-RI MSDC-RI MSDC-RI
Column type CapillaryCapillary
Active phase DB-5OV-101
Column length (m) 30.25.
Carrier gas
Substrate
Column diameter (mm)  0.25
Phase thickness (μm)
Tstart (C) 40.50.
Tend (C) 210.200.
Heat rate (K/min) 2.5.
Initial hold (min) 2.
Final hold (min) 120.
I 1637.1632.
ReferenceLoayza, Abujder, et al., 1995Menut, Lamaty, et al., 1995
Comment MSDC-RI MSDC-RI

Normal alkane RI, polar column, custom temperature program

Data compiled by: NIST Mass Spectrometry Data Center, William E. Wallace, director

Column type CapillaryCapillaryCapillaryCapillaryCapillary
Active phase InnowaxHP InnowaxInnowaxHP-Innowax FSCHP-Innowax
Column length (m) 60.50.30.60.50.
Carrier gas  HeliumHeliumN2He
Substrate
Column diameter (mm) 0.250.200.250.250.2
Phase thickness (μm) 0.330.250.250.250.2
Program not specified40 0C (5 min) 2 0C/min -> 270 0C -> 260 0C (20 min)not specified60C(10min) => 4C/min => 220C(10min) => 1C/min => 240C40C(5min) => 2C/min => 250C(15min) => 10C/min => 270C
I 2158.2187.2166.2187.2188.
ReferenceNoorizadeh, Farmany, et al., 2011Mancini, Arnold, et al., 2009Aicha, Ines, et al., 2008Baser K.H.C. and Demirci B., 2007Formisano, Mignola, et al., 2007
Comment MSDC-RI MSDC-RI MSDC-RI MSDC-RI MSDC-RI
Column type CapillaryCapillaryCapillaryCapillaryCapillary
Active phase Innowax FSCHP Innowax FSPHP-Innowax FSCHP-Innowax FSCInnowax FSC
Column length (m) 60.60.60.60.60.
Carrier gas NitrogenN2N2HeN2
Substrate
Column diameter (mm) 0.250.250.250.250.25
Phase thickness (μm) 0.250.250.250.250.25
Program 60 0C (10 min) 1 0C/min -> 220 0C (10 min) 1 0C/min -> 240 0C60C(10min) => 4C/min => 220C(10min) => 1C/min => 240C60C(10min) => 4C/min => 220C(10min) => 1C/min => 240C60C(10min) => 4C/min => 220C (10min) => 1C/min => 240C60C(10min) => 4C/min => 220C(10min) => 1C/min => 240C
I 2187.2187.2187.2187.2187.
ReferenceKaya, Benirci, et al., 2007Tabanca N., Demirci B., et al., 2007Demirci B., Baser K.H.C., et al., 2006Erdurak, Coskun, et al., 2006Iscan, Kirimer, et al., 2006
Comment MSDC-RI MSDC-RI MSDC-RI MSDC-RI MSDC-RI
Column type CapillaryCapillaryCapillaryCapillaryCapillary
Active phase HP-InnowaxHP-Innowax FSCHP-Innowax FSCDB-WaxHP-Innowax FSC
Column length (m) 50.60.60. 60.
Carrier gas HeN2N2N2He
Substrate
Column diameter (mm) 0.20.250.25 0.25
Phase thickness (μm) 0.20.250.25 0.25
Program 40C(5min) => 2C/min => 250C (15min) => 10C/min => 270C60C(10min) => 4C/min => 220C => (10min) => 1C/min => 240C60C(10min) => 4C/min => 220C (10min) => 1C/min => 240Cnot specified60C(10min) => 4C/min => 220C(10min) => 1C/min => 240C
I 2187.2187.2187.2177.2187.
ReferenceSenatore, Apostolides Arnold, et al., 2006Tabanca, Demirci, et al., 2006Demirci, Demirci, et al., 2005Pala-Paul, Perez-Alonso, et al., 2005Sezik E., Kocakulak E., et al., 2005
Comment MSDC-RI MSDC-RI MSDC-RI MSDC-RI MSDC-RI
Column type CapillaryCapillaryCapillaryCapillaryCapillary
Active phase HP-Innowax FSCHP-Innowax FSCHP-Innowax FSCHP-Innowax FSCCarbowax 20M
Column length (m) 60.60.60.60.
Carrier gas HeHeN2He
Substrate
Column diameter (mm) 0.250.250.250.25
Phase thickness (μm) 0.250.250.250.25
Program 60C(10min) => 4C/min => 220C(10min) => 1C/min => 240C60C(10min) => 4C/min => 220C(10min) => 1C/min => 240C60C(10min) => 4C/min => 220C(10min) => 1C/min => 240C60C(10min) => 4C/min => 220C(10min) => 1C/min => 240Cnot specified
I 2187.2187.2187.2187.2136.
ReferenceTabanca, Demirci, et al., 2005Demirci, Paper, et al., 2004Demirci, Paper, et al., 2004, 2Kivcak, Akay, et al., 2004Vinogradov, 2004
Comment MSDC-RI MSDC-RI MSDC-RI MSDC-RI MSDC-RI
Column type CapillaryCapillaryCapillaryCapillaryCapillary
Active phase Innowax FSCHP-Innowax FSCHP-FFAPHP-InnowaxInnowax FSC
Column length (m) 60.60.30.60.60.
Carrier gas HeHeHeHeHe
Substrate
Column diameter (mm) 0.250.250.250.250.25
Phase thickness (μm) 0.250.25 0.250.25
Program 60C(10min) => 4C/min => 220C (10min) => 1C/min => 240C60C (10min) => 4C/min => 220C (10min) => 1C/min => 240C60C (2min) => 5C/min => 160C (1min) => 10C/min => 230C (12min)60 0C (10 min) 4 K/min -> 220 0C (10 min) 1 K/min -> 240 0C60C(10min) => 4C/min => 220C(10min) => 1C/min => 240C
I 2187.2187.2204.2187.2187.
ReferenceBaser, Demirci, et al., 2003Demirci, Baser, et al., 2003Mockute and Judzentiene, 2003Baser, Demirci, et al., 2002Baser, Demirei, et al., 2002
Comment MSDC-RI MSDC-RI MSDC-RI MSDC-RI MSDC-RI
Column type CapillaryCapillaryCapillaryCapillaryCapillary
Active phase HP-Innowax FSCHP-FFAPInnowax FSCHP-InnowaxHP-Innowax
Column length (m) 60.25.60.60.60.
Carrier gas N2He HeHe
Substrate
Column diameter (mm) 0.250.220.250.250.25
Phase thickness (μm) 0.25 0.250.250.25
Program 60C(10min) => 4C/min => 220C(10min) => 1C/min => 240C60C(2min) => 5C/min => 160C(1min) => 10C/min => 230C(12min)60C(10min) => 4C/min => 220C(10min) => 1C/min => 240C60 0C (10 min) 10 K/min -> 220 0C (10 min) 1K/min -> 240 0C60 0C (10 min) 4 K/min -> 220 0C (10 min) 1 K/min -> 240 0C
I 2187.2204.2187.2187.2187.
ReferenceHüsnü Can Baser, Demirci, et al., 2002Mockute and Judzentiene, 2002Tunalier, Kirimer, et al., 2002Baser, Demirci, et al., 2001Gören, Demirci, et al., 2001
Comment MSDC-RI MSDC-RI MSDC-RI MSDC-RI MSDC-RI
Column type CapillaryCapillaryCapillaryCapillaryCapillary
Active phase HP-Innowax FSCInnowaxInnowaxInnowax FSCSupelcowax-10
Column length (m) 60.60.60.60.
Carrier gas  HeHeHe
Substrate
Column diameter (mm) 0.250.250.250.25
Phase thickness (μm) 0.25 0.250.25
Program 60C(10min) => 4C/min => 220C(10min) => 1C/min => 240C60 0C (10 min) 4 K/min -> 220 0C (10 min) 1 K/min -> 240 0C60 0C (10 min) 4 K/min -> 220 0C (10 min) 1 K/min -> 240 0C60C(10 min) => 4C/min => 220C(10min) => 1C/min => 240Cnot specified
I 2187.2187.2192.2187.2155.
ReferenceKaya, Demirci, et al., 2001Ahmed, Choudhary, et al., 2000Baser, Özek, et al., 2000Kirimer, Tabanca, et al., 2000Zunino, Lopez, et al., 2000
Comment MSDC-RI MSDC-RI MSDC-RI MSDC-RI MSDC-RI
Column type CapillaryCapillaryCapillary
Active phase InnowaxDB-WaxNB-351
Column length (m) 60.60.25.
Carrier gas  N2
Substrate
Column diameter (mm) 0.25 0.32
Phase thickness (μm) 0.250.250.2
Program 60C(10min) => 4C/min => 220C(10min) => 1C/min => 240Cnot specified40C(5min) => 4C/min => 170C => 8C/min => 240C (12min)
I 2192.2204.2187.
ReferenceBaser, Kürkcüoglu, et al., 1998Weyerstahl, Marschall, et al., 1998Kerrola, Galambosi, et al., 1994
Comment MSDC-RI MSDC-RI MSDC-RI

Normal alkane RI, non-polar column, temperature ramp

Data compiled by: NIST Mass Spectrometry Data Center, William E. Wallace, director

Column type CapillaryCapillaryCapillaryCapillaryCapillary
Active phase HP-5 MSRTX-1HP-5 MSDB-5DB-5
Column length (m) 60.60.30.30.30.
Carrier gas HeliumHeliumHeliumHeliumHelium
Substrate
Column diameter (mm) 0.250.220.250.320.25
Phase thickness (μm) 0.250.250.250.250.25
Tstart (C) 40.60.60.35.50.
Tend (C) 250.230.220.200.250.
Heat rate (K/min) 3.2.4.2.2.
Initial hold (min) 1. 20.
Final hold (min) 20.45.20.
I 1644.1620.1616.1608.1640.
ReferenceSardashti, Valizadeh, et al., 2013Yapi, Boti, et al., 2012Feizbakhsh and Naeemy, 2011Pattiram, Lasekan, et al., 2011Ho, Wang, et al., 2010
Comment MSDC-RI MSDC-RI MSDC-RI MSDC-RI MSDC-RI
Column type CapillaryCapillaryCapillaryCapillaryCapillary
Active phase SPB-1HP-5 MSHP-5 MSHP-5DB-1-MS
Column length (m) 30.30.30.30.60.
Carrier gas HeliumHeliumHeliumHydrogenHelium
Substrate
Column diameter (mm) 0.200.250.250.250.25
Phase thickness (μm) 0.200.250.250.250.25
Tstart (C) 70.60.70.70.30.
Tend (C) 220.220.290.290.200.
Heat rate (K/min) 3.5.5.5.2.
Initial hold (min)  10.  4.
Final hold (min) 15. 10. 35.
I 1614.1642.1649.1650.1615.
ReferenceNeves, Rosa, et al., 2010Ogunwande, Flamini, et al., 2010Radulovic, Blagojevic, et al., 2010Radulovic, Dordevic, et al., 2010Takeoka, Hobbs, et al., 2010
Comment MSDC-RI MSDC-RI MSDC-RI MSDC-RI MSDC-RI
Column type CapillaryCapillaryCapillaryCapillaryCapillary
Active phase DB-5HP-5 MSZB-5DB-5HP-5 MS
Column length (m) 30.30.30.30.30.
Carrier gas HeliumHeliumHeliumHeliumHydrogen
Substrate
Column diameter (mm) 0.250.250.250.250.25
Phase thickness (μm) 0.250.250.250.250.25
Tstart (C) 80.60.50.50.30.
Tend (C) 240.250.240.250.230.
Heat rate (K/min) 3.2.3.5.8.
Initial hold (min)  8. 2.5.
Final hold (min) 2.15.1. 10.
I 1631.1659.1626.1640.1660.
ReferenceVahirua-Lechat, Mitermite, et al., 2010Farhat, Ginies, et al., 2009Gardini, Beletti, et al., 2009Ho, Wang, et al., 2009Karlsson, Birgersson, et al., 2009
Comment MSDC-RI MSDC-RI MSDC-RI MSDC-RI MSDC-RI
Column type CapillaryCapillaryCapillaryCapillaryCapillary
Active phase RTX-1RTX-15 % Phenyl methyl siloxaneDB-5HP-5
Column length (m) 60.60.60.30.30.
Carrier gas HeliumHeliumHeliumNitrogenHelium
Substrate
Column diameter (mm) 0.220.220.250.250.25
Phase thickness (μm) 0.250.250.250.250.25
Tstart (C) 60.60.90.40.50.
Tend (C) 230.230.225.230.280.
Heat rate (K/min) 2.2.3.2.9.
Initial hold (min)     3.
Final hold (min) 30.30.3. 3.
I 1629.1633.1642.1641.1640.
ReferenceMuseli, Pau, et al., 2009Museli, Pau, et al., 2009Retta, Gattuso, et al., 2009Scrivanti, Anton, et al., 2009Aicha, Ines, et al., 2008
Comment MSDC-RI MSDC-RI MSDC-RI MSDC-RI MSDC-RI
Column type CapillaryCapillaryCapillaryCapillaryCapillary
Active phase HP-5HP-5HP-5RTX-1Elite-1
Column length (m) 30.30.30.60.30.
Carrier gas NitrogenHeliumHeliumHeHelium
Substrate
Column diameter (mm) 0.250.250.320.220.32
Phase thickness (μm) 0.250.250.250.250.25
Tstart (C) 50.50.100.60.60.
Tend (C) 280.300.240.230.246.
Heat rate (K/min) 5.3.5.2.3.
Initial hold (min) 1. 2.
Final hold (min) 1.30.5.35.
I 1632.1639.1640.1633.1636.
ReferenceBousaada, Ammar, et al., 2008Isidorov, Lech, et al., 2008Lago, Romoff, et al., 2008Paolini, Tomi, et al., 2008Raj, Baby, et al., 2008
Comment MSDC-RI MSDC-RI MSDC-RI MSDC-RI MSDC-RI
Column type CapillaryCapillaryCapillaryCapillaryCapillary
Active phase HP-5DB-5MSHP-5MSDB-5HP-5
Column length (m) 30.30.30.30.30.
Carrier gas HeliumHeHeHeN2
Substrate
Column diameter (mm) 0.250.250.250.260.25
Phase thickness (μm) 0.320.250.250.250.25
Tstart (C) 60.60.60.60.50.
Tend (C) 250.240.240.240.240.
Heat rate (K/min) 5.3.3.3.5.
Initial hold (min) 30.   1.
Final hold (min)     4.
I 1636.1642.1665.1634.1640.
ReferenceYassa and Akhani, 2008Andrade, Oliveira, et al., 2007Argyropoulou, Daferera, et al., 2007Bos, Woerdenbag, et al., 2007Cheraif, Ben Jannet, et al., 2007
Comment MSDC-RI MSDC-RI MSDC-RI MSDC-RI MSDC-RI
Column type CapillaryCapillaryCapillaryCapillaryCapillary
Active phase DB-5HP-5MS5 % Phenyl methyl siloxaneHP-1BP-1
Column length (m) 30.30.60.30.
Carrier gas HeliumHeHeHeHe
Substrate
Column diameter (mm) 0.260.250.250.25
Phase thickness (μm) 0.250.250.250.25
Tstart (C) 60.60.90.60.60.
Tend (C) 290.250.225.240.220.
Heat rate (K/min) 3.2.3.2.5.
Initial hold (min)  8.
Final hold (min)  15.15.20.6.
I 1634.1636.1646.1617.1642.
ReferenceElfami, Bos, et al., 2007Ferhat, Tigrine-Kordjani, et al., 2007Gil A., Van Baren C.M., et al., 2007Hachicha, Skanji, et al., 2007Kiran, Devi, et al., 2007
Comment MSDC-RI MSDC-RI MSDC-RI MSDC-RI MSDC-RI
Column type CapillaryCapillaryCapillaryCapillaryCapillary
Active phase DB-5HP-5HP-5 MSDB-5HP-5MS
Column length (m) 30.25.60.30.30.
Carrier gas HeliumH2Hydrogen He
Substrate
Column diameter (mm) 0.250.20.250.250.25
Phase thickness (μm) 0.250.330.250.250.25
Tstart (C) 60.60.60.40.40.
Tend (C) 300.240.260.210.250.
Heat rate (K/min) 3.3.4.2.3.
Initial hold (min)     5.
Final hold (min)   20.33.10.
I 1611.1643.1629.1639.1636.
ReferenceMoreno, Lima, et al., 2007Oliveira, Leitão, et al., 2007Rojas, Velasco, et al., 2007Sylvestre, Longtin, et al., 2007Vichi, Riu-Aumatell, et al., 2007
Comment MSDC-RI MSDC-RI MSDC-RI MSDC-RI MSDC-RI
Column type CapillaryCapillaryCapillaryCapillaryCapillary
Active phase HP-5DB-5DB-5BP-1DB-1
Column length (m) 30.30.30.50.60.
Carrier gas HeHe  Nitrogen
Substrate
Column diameter (mm) 0.250.250.250.220.25
Phase thickness (μm) 0.320.250.250.25
Tstart (C) 60.60.60.60.40.
Tend (C) 250.300.300.220.200.
Heat rate (K/min) 5.3.3.2.2.
Initial hold (min) 30.   1.
Final hold (min)    20.9.
I 1636.1630.1635.1630.1620.
ReferenceYassa and Akhani, 2007Apel, Sobral, et al., 2006Apel, Sobral, et al., 2006, 2Boti, Yao, et al., 2006Chen, Sheu, et al., 2006
Comment MSDC-RI MSDC-RI MSDC-RI MSDC-RI MSDC-RI
Column type CapillaryCapillaryCapillaryCapillaryCapillary
Active phase DB-5HP-5DB-5BP-1HP-5
Column length (m) 30.30.30. 30.
Carrier gas HeliumHe HeliumHe
Substrate
Column diameter (mm) 0.260.250.25 0.25
Phase thickness (μm) 0.250.250.25 0.25
Tstart (C) 60.50.40.60.100.
Tend (C) 290.300.210.220.240.
Heat rate (K/min) 3.5.2.5.5.
Initial hold (min)  5.2. 2.
Final hold (min)  5.33.6.5.
I 1634.1642.1637.1642.1637.
ReferenceElfami, Komar, et al., 2006Figuérédo, Cabassu, et al., 2006Garneau F.X., Collin G., et al., 2006Kiran, Bhavani, et al., 2006Lago, Soares, et al., 2006
Comment MSDC-RI MSDC-RI MSDC-RI MSDC-RI MSDC-RI
Column type CapillaryCapillaryCapillaryCapillaryCapillary
Active phase BP-1CP Sil 5 CBDB-5DB-5HP-5
Column length (m) 50.30.30.25.30.
Carrier gas HeN2HeN2He
Substrate
Column diameter (mm) 0.220.320.250.250.25
Phase thickness (μm) 0.250.250.250.150.25
Tstart (C) 60.50.60.50.60.
Tend (C) 220.300.220.200.220.
Heat rate (K/min) 2.4.4.4.5.
Initial hold (min)   5.3.10.
Final hold (min) 20.
I 1629.1621.1641.1630.1638.
ReferenceLesueur, Ban, et al., 2006Lis and Milczarek, 2006Morteza-Semnani K., Saeedi M., et al., 2006Ouamba, Ouabonzi, et al., 2006Pintore G., Chessa M., et al., 2006
Comment MSDC-RI MSDC-RI MSDC-RI MSDC-RI MSDC-RI
Column type CapillaryCapillaryCapillaryCapillaryCapillary
Active phase DB-5HP-5MSMethyl SiliconeDB-5MSDB-5
Column length (m) 30.30.25.30.25.
Carrier gas HeHeN2He
Substrate
Column diameter (mm) 0.250.250.30.250.25
Phase thickness (μm) 0.250.250.150.250.15
Tstart (C) 60.60.50.60.40.
Tend (C) 200.280.210.240.220.
Heat rate (K/min) 2.4.2.3.3.
Initial hold (min)   5. 5.
Final hold (min) 60.
I 1641.1643.1661.1641.1643.
ReferenceRout, Naik, et al., 2006Sajjadi, 2006Tonzibo, Coffy, et al., 2006Busman, Zoghbi, et al., 2005Chagonda and Chalchat, 2005
Comment MSDC-RI MSDC-RI MSDC-RI MSDC-RI MSDC-RI
Column type CapillaryCapillaryCapillaryCapillaryCapillary
Active phase DB-5HP-5HP-5DB-5DB-5
Column length (m) 30.30.30.30.30.
Carrier gas HeHeHeHe
Substrate
Column diameter (mm) 0.250.250.250.320.25
Phase thickness (μm) 0.250.250.25 0.25
Tstart (C) 60.60.50.60.35.
Tend (C) 300.30.300.240.280.
Heat rate (K/min) 3.4.5.3.4.
Initial hold (min) 3.3.5. 2.
Final hold (min)  15.5.
I 1634.1639.1642.1642.1646.
ReferenceFerraz, Limberger, et al., 2005Ferretti, Maggi, et al., 2005Figuérédo, Cabassu, et al., 2005Khayyat and Karimi, 2005Kowalski and Wolski, 2005
Comment MSDC-RI MSDC-RI MSDC-RI MSDC-RI MSDC-RI
Column type CapillaryCapillaryCapillaryCapillaryCapillary
Active phase DB-5DB-5CP Sil 5 CBHP-5DB-1
Column length (m) 30.30.25.30.50.
Carrier gas HeHe HeN2
Substrate
Column diameter (mm) 0.250.250.250.250.25
Phase thickness (μm) 0.250.250.150.250.25
Tstart (C) 60.60.50.70.95.
Tend (C) 230.220.230.240.240.
Heat rate (K/min) 3.4.3.5.4.
Initial hold (min)  4.
Final hold (min)
I 1632.1640.1631.1641.1630.
ReferenceLimberger, Sobral, et al., 2005Morteza-Semnani and Saeedi, 2005Olawore, Ogunwande, et al., 2005Oyedeji, Yani, et al., 2005Pala-Paul, Perez-Alonso, et al., 2005
Comment MSDC-RI MSDC-RI MSDC-RI MSDC-RI MSDC-RI
Column type CapillaryCapillaryCapillaryCapillaryCapillary
Active phase HP-5MSHP-5MSHP-5MSHP-5MSDB-5
Column length (m) 30.30.30.30.30.
Carrier gas HeHeHeHeHe
Substrate
Column diameter (mm) 0.250.250.250.250.25
Phase thickness (μm) 0.250.250.250.250.25
Tstart (C) 60.60.60.60.60.
Tend (C) 280.275.280.280.300.
Heat rate (K/min) 4.4.4.3.3.
Initial hold (min)    5.
Final hold (min)
I 1641.1640.1639.1640.1638.
ReferenceSajjadi S.E. and Eskandari B., 2005Sajjadi and Ghannadi, 2005Sajjadi, 2005Setzer, Noletto, et al., 2005Simoes-Pires C.A., Debenedetti S., et al., 2005
Comment MSDC-RI MSDC-RI MSDC-RI MSDC-RI MSDC-RI
Column type CapillaryCapillaryCapillaryCapillaryCapillary
Active phase PE-5BP-1BP-1DB-5DB-5
Column length (m) 30.30.30.30.30.
Carrier gas H2N2N2 He
Substrate
Column diameter (mm) 0.320.320.320.250.32
Phase thickness (μm) 0.250.250.250.250.25
Tstart (C) 60.60.60.40.60.
Tend (C) 230.220.220.210.280.
Heat rate (K/min) 5.5.5.2.3.
Initial hold (min) 2.  2.
Final hold (min) 4.15.15.33.
I 1626.1643.1617.1641.1611.
ReferenceSingh, Raina, et al., 2005Srivastava, Srivastava, et al., 2005Srivastava, Srivastava, et al., 2005Stevanovic, Garneau, et al., 2005Tzakou and Constantinidis, 2005
Comment MSDC-RI MSDC-RI MSDC-RI MSDC-RI MSDC-RI
Column type CapillaryCapillaryCapillaryCapillaryCapillary
Active phase DB-1DB-1HP-5MSCP Sil 5 CBBP-1
Column length (m) 50.50.30.30.50.
Carrier gas N2  N2
Substrate
Column diameter (mm) 0.250.250.250.250.22
Phase thickness (μm) 0.250.250.250.250.25
Tstart (C) 90.60.40.50.60.
Tend (C) 240.240.220.200.220.
Heat rate (K/min) 4.3.3.5.2.
Initial hold (min)   5.
Final hold (min)   10. 20.
I 1640.1612.1636.1633.1628.
ReferenceVelasco-Negueruela, Pérez-Alonso, et al., 2005Velasco-Negueruela, Pérez-Alonso, et al., 2005, 2Vichi, Riu-Aumatell, et al., 2005Agnaniet, Menut, et al., 2004Blanc, Muselli, et al., 2004
Comment MSDC-RI MSDC-RI MSDC-RI MSDC-RI MSDC-RI
Column type CapillaryCapillaryCapillaryCapillaryCapillary
Active phase DB-1DB-5DB-5DB-5RTX-1
Column length (m) 30.25.30.30.30.
Carrier gas N2NitrogenHeHeN2
Substrate
Column diameter (mm) 0.250.250.250.250.32
Phase thickness (μm) 0.250.250.250.250.25
Tstart (C) 50.60.60.60.60.
Tend (C) 200.240.300.300.300.
Heat rate (K/min) 5.3.3.3.4.
Initial hold (min)
Final hold (min)
I 1624.1642.1637.1628.1630.
ReferenceFekam Boyom, Fotio, et al., 2004JAvidnia, Mojab, et al., 2004Lago, de Ávila, et al., 2004Limberger, Sobral, et al., 2004Lis, Boczek, et al., 2004
Comment MSDC-RI MSDC-RI MSDC-RI MSDC-RI MSDC-RI
Column type CapillaryCapillaryCapillaryCapillaryCapillary
Active phase DB-5HP-5MSHP-5MSNB-30NB-30
Column length (m) 30.30.30.50.50.
Carrier gas  HeHeHeHe
Substrate
Column diameter (mm) 0.250.250.250.20.2
Phase thickness (μm) 0.250.250.250.250.25
Tstart (C) 40.60.60.50.50.
Tend (C) 210.280.275.250.250.
Heat rate (K/min) 2.3.4.2.2.
Initial hold (min) 2.
Final hold (min) 33.
I 1638.1638.1648.1629.1629.
ReferenceLopez Arze, Collin, et al., 2004Malencic, Couladis, et al., 2004Mehrabani, Asadipour, et al., 2004Orav, Stulova, et al., 2004Orav, Stulova, et al., 2004
Comment MSDC-RI MSDC-RI MSDC-RI MSDC-RI MSDC-RI
Column type CapillaryCapillaryCapillaryCapillaryCapillary
Active phase NB-30DB-1DB-5DB-5HP-1
Column length (m) 50.30.30.30.30.
Carrier gas HeHe HeHe
Substrate
Column diameter (mm) 0.200.250.250.250.25
Phase thickness (μm) 0.250.250.250.250.25
Tstart (C) 50.50.60.60.70.
Tend (C) 250.265.300.300.200.
Heat rate (K/min) 2.2.53.3.10.
Initial hold (min)  1.
Final hold (min)  20.
I 1632.1617.1628.1640.1624.
ReferenceRaal, Paaver, et al., 2004Sarkhail, Amin, et al., 2004Suyenaga, Apel, et al., 2004Tirillini, Pellegrino, et al., 2004Fekam Boyom, Amvam Zollo, et al., 2003
Comment MSDC-RI MSDC-RI MSDC-RI MSDC-RI MSDC-RI
Column type CapillaryCapillaryCapillaryCapillaryCapillary
Active phase DB-1Methyl SiliconeRSL-200RSL-200DB-5
Column length (m) 30.30.30.30.30.
Carrier gas N2HeH2H2He
Substrate
Column diameter (mm) 0.250.320.320.320.25
Phase thickness (μm) 0.250.250.250.250.25
Tstart (C) 50.60.40.40.60.
Tend (C) 200.250.280.280.250.
Heat rate (K/min) 5.2.6.6.3.
Initial hold (min)  2.5.5.
Final hold (min)  5.5.5.
I 1602.1626.1635.1624.1634.
ReferenceFekam Boyom, Ngouana, et al., 2003Jayaprakasha, Rao, et al., 2003Jirovetz, Buchbauer, et al., 2003Jirovetz, Buchbauer, et al., 2003, 2Limberger, Simões-Pires, et al., 2003
Comment MSDC-RI MSDC-RI MSDC-RI MSDC-RI MSDC-RI
Column type CapillaryCapillaryCapillaryCapillaryCapillary
Active phase DB-1OV-101CP Sil 5 CBDB-1HP-5
Column length (m) 60.50.25.50.30.
Carrier gas HeHeH2N2He
Substrate
Column diameter (mm) 0.250.20.250.250.25
Phase thickness (μm) 0.250.50.150.250.25
Tstart (C) 50.50.50.95.60.
Tend (C) 270.250.230.240.280.
Heat rate (K/min) 4.2.3.4.3.
Initial hold (min)
Final hold (min)
I 1630.1624.1615.1630.1623.
ReferenceMirza, Nik, et al., 2003Orav, Kailas, et al., 2003Oyedeji, Ekundayo, et al., 2003Perez-Alonso, Velasco-Negueruela, et al., 2003Pitarokili, Tzakou, et al., 2003
Comment MSDC-RI MSDC-RI MSDC-RI MSDC-RI MSDC-RI
Column type CapillaryCapillaryCapillaryCapillaryCapillary
Active phase DB-1DB-5HP-5DB-5DB-5
Column length (m) 60.30.30.30.30.
Carrier gas HeN2He He
Substrate
Column diameter (mm) 0.250.250.250.250.25
Phase thickness (μm) 0.250.250.250.250.25
Tstart (C) 50.40.60.40.60.
Tend (C) 250.230.280.260.240.
Heat rate (K/min) 4.2.4.2.3.
Initial hold (min)    5.
Final hold (min)
I 1619.1640.1636.1648.1647.
ReferencePourmortazavi, Sefidkon, et al., 2003Rotman, Ahumada, et al., 2003Sajjadi and Mehregan, 2003Senatore and Bruno, 2003da Silva, Luz, et al., 2003
Comment MSDC-RI MSDC-RI MSDC-RI MSDC-RI MSDC-RI
Column type CapillaryCapillaryCapillaryCapillaryCapillary
Active phase HP-5DB-5DB-5HP-1BP-1
Column length (m) 60.30.30.30.25.
Carrier gas  HeHeHeN2
Substrate
Column diameter (mm) 0.250.250.2490.250.50
Phase thickness (μm) 0.250.250.250.250.25
Tstart (C) 40.60.60.70.60.
Tend (C) 250.240.300.220.220.
Heat rate (K/min) 5.3.3.3.5.
Initial hold (min) 15.
Final hold (min)   5.15.10.
I 1639.1641.1643.1616.1617.
ReferenceStashenko, Jaramillo, et al., 2003Zoghbi, Andrade, et al., 2003Bos, Koulman, et al., 2002Cavaleiro, Salgueiro, et al., 2002Das, Ram, et al., 2002
Comment MSDC-RI MSDC-RI MSDC-RI MSDC-RI MSDC-RI
Column type CapillaryCapillaryCapillaryCapillaryCapillary
Active phase DB-5PTE-5CP Sil 8 CBDB-5DB-5
Column length (m) 30.60.30.30.30.
Carrier gas HeH2He He
Substrate
Column diameter (mm) 0.250.320.250.250.25
Phase thickness (μm) 0.250.300.250.250.25
Tstart (C) 60.60.50.40.60.
Tend (C) 240.285.220.210.240.
Heat rate (K/min) 3.4.33.2.3.
Initial hold (min)   2.2.
Final hold (min)    33.
I 1642.1640.1625.1644.1638.
ReferenceFlamini, Ertugrul, et al., 2002Gudzic, Djokovic, et al., 2002Juteau, Masotti, et al., 2002Kabouss, Charrouf, et al., 2002Kobaisy, Tellez, et al., 2002
Comment MSDC-RI MSDC-RI MSDC-RI MSDC-RI MSDC-RI
Column type CapillaryCapillaryCapillaryCapillaryCapillary
Active phase DB-5DB-5DB-5DB-5DB-5MS
Column length (m) 30.30.30.30.30.
Carrier gas HeHeHeHeHe
Substrate
Column diameter (mm) 0.250.250.250.250.25
Phase thickness (μm) 0.250.250.250.250.25
Tstart (C) 35.35.60.60.60.
Tend (C) 280.280.250.240.240.
Heat rate (K/min) 3.4.3.3.3.
Initial hold (min) 2.2.
Final hold (min) 15.15.
I 1652.1653.1632.1639.1641.
ReferenceKrauze-Baranowska, Mardarowicz, et al., 2002Krauze-Baranowska, Mardarowicz, et al., 2002, 2Limberger, Simões-Pires, et al., 2002Maia, da Silva, et al., 2002Maia, Zoghbi, et al., 2002
Comment MSDC-RI MSDC-RI MSDC-RI MSDC-RI MSDC-RI
Column type CapillaryCapillaryCapillaryCapillaryCapillary
Active phase OV-101DB-1DB-5DB-1DB-1
Column length (m) 25.50.25.60.60.
Carrier gas HeN2HeHeHe
Substrate
Column diameter (mm) 0.320.250.20.250.25
Phase thickness (μm)  0.25  0.25
Tstart (C) 50.80.60.40.40.
Tend (C) 200.225.220.250.280.
Heat rate (K/min) 5.4.3.4.4.
Initial hold (min)     5.
Final hold (min)
I 1636.1612.1631.1617.1622.
ReferenceMenut, Bessière, et al., 2002Palá-Paúl, Pérez-Alonso, et al., 2002Schwob, Bessière, et al., 2002Sefidkon, Dabiri, et al., 2002Sefidkon, 2002
Comment MSDC-RI MSDC-RI MSDC-RI MSDC-RI MSDC-RI
Column type CapillaryCapillaryCapillaryCapillaryCapillary
Active phase DB-1DB-5MSDB-1DB-1HP-5
Column length (m) 50.30.60.60.30.
Carrier gas N2HeHeHeN2
Substrate
Column diameter (mm) 0.250.250.250.250.25
Phase thickness (μm) 0.250.250.250.250.25
Tstart (C) 60.60.40.40.60.
Tend (C) 240.270.280.280.220.
Heat rate (K/min) 3.3.4.4.5.
Initial hold (min)   5.5.10.
Final hold (min)
I 1610.1641.1627.1628.1642.
ReferenceVelasco-Negueruela, Pérez-Alonso, et al., 2002Zoghbi, Andrade, et al., 2002Dabiri and Sefidkon, 2001Dabiri and Sefidkon, 2001Flamini, Cioni, et al., 2001
Comment MSDC-RI MSDC-RI MSDC-RI MSDC-RI MSDC-RI
Column type CapillaryCapillaryCapillaryCapillaryCapillary
Active phase Optima-5RTX-1DB-5MSOV-101DB-1
Column length (m) 30.30.30.50.30.
Carrier gas HeN2HeHeN2
Substrate
Column diameter (mm) 0.20.250.250.20.25
Phase thickness (μm)  0.250.250.50.25
Tstart (C) 50.60.60.50.80.
Tend (C) 250.300.240.250.225.
Heat rate (K/min) 3.4.3.2.4.
Initial hold (min) 3.
Final hold (min)   30.
I 1651.1631.1618.1620.1601.
ReferenceJacquemond-Collet, Bessière, et al., 2001Kalemba, Marschall, et al., 2001Marongiu, Porcedda, et al., 2001Orav, Kailas, et al., 2001Palá-Paúl, Pérez-Alonso, et al., 2001
Comment MSDC-RI MSDC-RI MSDC-RI MSDC-RI MSDC-RI
Column type CapillaryCapillaryCapillaryCapillaryCapillary
Active phase DB-1CP Sil 5 CBDB-1HP-1DB-5
Column length (m) 30.25.25.60.30.
Carrier gas He NitrogenHeHe
Substrate
Column diameter (mm) 0.20.250.500.250.25
Phase thickness (μm)  0.150.250.250.25
Tstart (C) 60.50.60.60.60.
Tend (C) 240.230.220.200.240.
Heat rate (K/min) 3.3.5.4.3.
Initial hold (min)    5.
Final hold (min)    25.
I 1638.01613.1617.1639.1640.
ReferenceSantos, Moreira, et al., 2001Asekun and Ekundayo, 2000Mallavarapu, Rao, et al., 2000Meccia, Rojas, et al., 2000Tellez, Dayan, et al., 2000
Comment MSDC-RI MSDC-RI MSDC-RI MSDC-RI MSDC-RI
Column type CapillaryCapillaryCapillaryCapillaryCapillary
Active phase OV-101DB-1OV-101BP-1OV-101
Column length (m) 25.25.25.25.50.
Carrier gas N2He N2N2
Substrate
Column diameter (mm) 0.250.250.320.500.2
Phase thickness (μm)  0.25 0.25
Tstart (C) 50.50.50.60.80.
Tend (C) 200.290.200.220.200.
Heat rate (K/min) 5.4.5.5.1.
Initial hold (min)
Final hold (min)    10.20.
I 1635.1643.1625.1615.1636.
ReferenceAyedoun, Adéoti, et al., 1999Koulman, 1999Kuiate, Zollo, et al., 1999Mallavarapu, Kulkarni, et al., 1999Menon, Chacko, et al., 1999
Comment MSDC-RI MSDC-RI MSDC-RI MSDC-RI MSDC-RI
Column type CapillaryCapillaryCapillaryCapillaryCapillary
Active phase DB-1DB-5DB-5DB-5OV-1
Column length (m) 60.30.30.30.50.
Carrier gas HeHeHeHeHe
Substrate
Column diameter (mm) 0.250.250.250.250.32
Phase thickness (μm) 0.250.250.250.250.25
Tstart (C) 40.60.60.60.50.
Tend (C) 280.240.240.240.250.
Heat rate (K/min) 4.3.3.3.10.
Initial hold (min) 5.   5.
Final hold (min)     20.
I 1632.1638.1642.1638.1637.
ReferenceSefidkon, Dabiri, et al., 1999Tellez, Canel, et al., 1999Zoghbi, Andrade, et al., 1999El-Sakhawy, El-Tantawy, et al., 1998Kökdil, Kurucu, et al., 1998
Comment MSDC-RI MSDC-RI MSDC-RI MSDC-RI MSDC-RI
Column type CapillaryCapillaryCapillaryCapillaryCapillary
Active phase OV-101DB-5DB-1DB-5OV-101
Column length (m) 25.30. 30.50.
Carrier gas  He HeHe
Substrate
Column diameter (mm) 0.320.32 0.250.25
Phase thickness (μm)
Tstart (C) 50.60.80.60.50.
Tend (C) 200.250.220.240.250.
Heat rate (K/min) 5.3.6.4.2.
Initial hold (min)
Final hold (min)
I 1636.1627.1616.1610.1622.
ReferenceZollo, Biyiti, et al., 1998Abreu and Noronha, 1997Salgueiro, Vila, et al., 1997Zunino, Novillo-Newton, et al., 1997Orav, Kailas, et al., 1996
Comment MSDC-RI MSDC-RI MSDC-RI MSDC-RI MSDC-RI
Column type CapillaryCapillaryCapillary
Active phase HP-1CP Sil 8 CBRSL-150
Column length (m) 25.25.30.
Carrier gas Helium
Substrate
Column diameter (mm) 0.320.200.32
Phase thickness (μm) 0.25 0.20
Tstart (C) 60.60.30.
Tend (C) 220.230.200.
Heat rate (K/min) 4.3.3.
Initial hold (min) 2.10.
Final hold (min) 20.
I 1621.1671.1626.
ReferenceThanh, Dung, et al., 1996Jantan and Goh, 1990Ronse and De Pooter, 1990
Comment MSDC-RI MSDC-RI MSDC-RI

Van Den Dool and Kratz RI, non-polar column, temperature ramp

Data compiled by: NIST Mass Spectrometry Data Center, William E. Wallace, director

Column type CapillaryCapillaryCapillaryCapillaryCapillary
Active phase BP-1BP-1DB-5BP-1DB-5
Column length (m) 50.50.30.50.30.
Carrier gas HeHeHeHeHe
Substrate
Column diameter (mm) 0.220.220.250.220.25
Phase thickness (μm) 0.250.250.250.250.25
Tstart (C) 60.60.60.60.60.
Tend (C) 220.220.240.220.240.
Heat rate (K/min) 2.2.3.2.3.
Initial hold (min)
Final hold (min) 20.20. 20.
I 1628.1637.1642.1626.1642.
ReferenceBoti, Koukoua, et al., 2007Duquesnoy, Castola, et al., 2007Flamini, Cioni, et al., 2007Lesueur, de Rocca Serra, et al., 2007Maccioni, Baldini, et al., 2007
Comment MSDC-RI MSDC-RI MSDC-RI MSDC-RI MSDC-RI
Column type CapillaryCapillaryCapillaryCapillaryCapillary
Active phase DB-5Methyl SiliconeRTX-1RTX-1RTX-1
Column length (m) 30.30.60.60.60.
Carrier gas  HeHeHeHe
Substrate
Column diameter (mm) 0.220.250.220.220.22
Phase thickness (μm) 0.250.250.250.250.25
Tstart (C) 60.80.60.60.60.
Tend (C) 240.220.230.230.230.
Heat rate (K/min) 3.2.2.2.2.
Initial hold (min) 2.
Final hold (min)  15.30.35.35.
I 1642.1633.1635.1625.1628.
ReferenceMartins, Santos, et al., 2007Melo, Corrêa, et al., 2007Muselli, Rossi, et al., 2007Paolini J., Costa J., et al., 2007Paolini, Muselli, et al., 2007
Comment MSDC-RI MSDC-RI MSDC-RI MSDC-RI MSDC-RI
Column type CapillaryCapillaryCapillaryCapillaryCapillary
Active phase SPB-1HP-5MSHP-5MSHP-5MSDB-5
Column length (m) 30.30.30.30.30.
Carrier gas HeHeHeHeHe
Substrate
Column diameter (mm) 0.250.250.250.250.22
Phase thickness (μm) 0.250.250.250.250.25
Tstart (C) 50.60.60.60.55.
Tend (C) 250.280.280.280.240.
Heat rate (K/min) 5.4.4.4.3.
Initial hold (min) 3.5.5.5.2.
Final hold (min) 15.   15.
I 1640.1635.1639.1635.1640.
ReferenceRadulovic, Lazarevic, et al., 2007Radulovic, Lazarevic, et al., 2007Saroglou, Arfan, et al., 2007Saroglou, Marin, et al., 2007Silva, Barbosa, et al., 2007
Comment MSDC-RI MSDC-RI MSDC-RI MSDC-RI MSDC-RI
Column type CapillaryCapillaryCapillaryCapillaryCapillary
Active phase DB-5DB-5HP-5MSHP-5MSBP-1
Column length (m) 30.30.30.30.50.
Carrier gas HeHeHeHe
Substrate
Column diameter (mm) 0.250.250.250.250.22
Phase thickness (μm) 0.250.250.250.250.25
Tstart (C) 60.50.80.60.60.
Tend (C) 240.250.300.280.220.
Heat rate (K/min) 3.3.4.3.2.
Initial hold (min)
Final hold (min)  10.  20.
I 1640.1640.1647.61615.1629.
ReferenceTelascrea, de Araujo, et al., 2007Yu, Liao, et al., 2007Zeng, Zhao, et al., 2007Basta, Tzakou, et al., 2006Blanc, Bradesi, et al., 2006
Comment MSDC-RI MSDC-RI MSDC-RI MSDC-RI MSDC-RI
Column type CapillaryCapillaryCapillaryCapillaryCapillary
Active phase BP-1HP-5MSDB-5DB-5HP-5
Column length (m) 50.30.30.30.30.
Carrier gas HeHeN2N2N2
Substrate
Column diameter (mm) 0.220.250.320.250.25
Phase thickness (μm) 0.250.250.250.250.25
Tstart (C) 60.60.60.60.60.
Tend (C) 220.280.240.240.220.
Heat rate (K/min) 2.3.3.3.5.
Initial hold (min)   3.3.10.
Final hold (min) 20. 5.3.
I 1620.1633.1637.1638.1644.
ReferenceBoti, Bighelli, et al., 2006Chorianopoulos N., Evergets E., et al., 2006Dob, Dahmane, et al., 2006Dob, Dahmane, et al., 2006, 2Flamini, Tebano, et al., 2006
Comment MSDC-RI MSDC-RI MSDC-RI MSDC-RI MSDC-RI
Column type CapillaryCapillaryCapillaryCapillaryCapillary
Active phase BP-1HP-5DB-1HP-5MSSPB-1
Column length (m) 50.30.30.30.30.
Carrier gas HeHeN2HeHe
Substrate
Column diameter (mm) 0.220.250.250.250.25
Phase thickness (μm) 0.250.250.250.250.25
Tstart (C) 60.60.50.60.50.
Tend (C) 220.260.220.280.250.
Heat rate (K/min) 2.3.4.3.5.
Initial hold (min)     3.
Final hold (min) 20.   15.
I 1629.1637.1643.1608.1643.
ReferenceGonny, Cavaleiro, et al., 2006Javidnia K., Miri R., et al., 2006Kuiate, Bessière, et al., 2006Pavlovic, Kovacevic, et al., 2006Radulovic, Mananjarasoa, et al., 2006
Comment MSDC-RI MSDC-RI MSDC-RI MSDC-RI MSDC-RI
Column type CapillaryCapillaryCapillaryCapillaryCapillary
Active phase DB-1HP-5SPB-1HP-5MSDB-5
Column length (m) 30.25.30.30.30.
Carrier gas HeHeHeHeHe
Substrate
Column diameter (mm) 0.250.250.20.250.25
Phase thickness (μm) 0.250.250.20.250.25
Tstart (C) 60.60.70.60.50.
Tend (C) 240.240.220.280.250.
Heat rate (K/min) 4.4.3.4.5.
Initial hold (min)    5.2.
Final hold (min)   15.
I 1640.1635.1615.1634.1640.
ReferenceRezazadeh, Hamedani, et al., 2006Rezazadeh, Hamedani, et al., 2006Salgueiro L.R., Pinto E., et al., 2006Saroglou, Dorizas, et al., 2006Su, Ho, et al., 2006
Comment MSDC-RI MSDC-RI MSDC-RI MSDC-RI MSDC-RI
Column type CapillaryCapillaryCapillaryCapillaryCapillary
Active phase HP-5MSCP Sil 5 CBSPB-1DB-5BP-1
Column length (m) 30.25.30.30.50.
Carrier gas H2H2HeHeHe
Substrate
Column diameter (mm) 0.250.250.250.20.22
Phase thickness (μm) 0.25 0.250.250.25
Tstart (C) 50.80.50.50.60.
Tend (C) 285.270.250.250.220.
Heat rate (K/min) 4.310.5.5.2.
Initial hold (min)   3.3.
Final hold (min)   15.15.20.
I 1648.1633.1638.1642.1629.
ReferenceVujisic L., Vuckovic I., et al., 2006Ziegenbein, Hanssen, et al., 2006Boskovic, Radulovic, et al., 2005Boskovic, Radulovic, et al., 2005Boti J.B., Koukoua G., et al., 2005
Comment MSDC-RI MSDC-RI MSDC-RI MSDC-RI MSDC-RI
Column type CapillaryCapillaryCapillaryCapillaryCapillary
Active phase HP-5DB-1DB-1BP-1HP-5
Column length (m) 30.30.30.50.30.
Carrier gas N2N2HeHeN2
Substrate
Column diameter (mm) 0.250.320.250.220.25
Phase thickness (μm) 0.250.250.250.250.25
Tstart (C) 60.50.40.60.60.
Tend (C) 220.260.260.220.220.
Heat rate (K/min) 5.2.2.2.5.
Initial hold (min) 10.3.5. 10.
Final hold (min)  5.20.20.
I 1642.1622.1625.1627.1642.
ReferenceCelik, Gokturk, et al., 2005Dob, Berramdane, et al., 2005de Feo, Urrunaga Soria, et al., 2005Ferrari, Tomi, et al., 2005Flamini, Luigi Cioni, et al., 2005
Comment MSDC-RI MSDC-RI MSDC-RI MSDC-RI MSDC-RI
Column type CapillaryCapillaryCapillaryCapillaryCapillary
Active phase DB-5RTX-1DB-5HP-5MSSPB-1
Column length (m) 25.60.30.30.30.
Carrier gas N2HeHeHeHe
Substrate
Column diameter (mm) 0.250.220.250.250.25
Phase thickness (μm) 0.250.250.250.250.25
Tstart (C) 75.60.40.60.70.
Tend (C) 210.230.260.280.220.
Heat rate (K/min) 3.2.2.3.3.
Initial hold (min) 10. 5.
Final hold (min) 1.35.20. 15.
I 1642.1625.1640.1640.1616.
Referencebin Jantan, Yalvema, et al., 2005Paolini, Costa, et al., 2005Senatore, Napolitano, et al., 2005Aligiannis, Kalpoutzakis, et al., 2004Antunes, Sevinate-Pinto, et al., 2004
Comment MSDC-RI MSDC-RI MSDC-RI MSDC-RI MSDC-RI
Column type CapillaryCapillaryCapillaryCapillaryCapillary
Active phase SPB-1HP-5HP-5MSHP-5HP-5MS
Column length (m) 30.30.30.30.30.
Carrier gas He HeN2He
Substrate
Column diameter (mm) 0.20.250.250.250.25
Phase thickness (μm) 0.20.250.250.250.25
Tstart (C) 70.60.60.60.60.
Tend (C) 220.220.280.220.280.
Heat rate (K/min) 3.5.3.5.4.
Initial hold (min)  10. 10.5.
Final hold (min) 15.
I 1615.1641.1633.1641.1637.
ReferenceCavaleiro, Salgueiro, et al., 2004Ceccarini, Macchia, et al., 2004Chorianopoulos, Kalpoutzakis, et al., 2004Flamini, Luigi Cioni, et al., 2004Grujic-Jovanovic, Skaltsa, et al., 2004
Comment MSDC-RI MSDC-RI MSDC-RI MSDC-RI MSDC-RI
Column type CapillaryCapillaryCapillaryCapillaryCapillary
Active phase HP-5MSDB-5MSBP-1BP-1DB-5
Column length (m) 30.30.30.30.25.
Carrier gas HeHeN2N2N2
Substrate
Column diameter (mm) 0.250.250.320.320.25
Phase thickness (μm) 0.250.250.250.250.25
Tstart (C) 60.40.60.60.75.
Tend (C) 280.280.220.220.210.
Heat rate (K/min) 4.4.5.5.3.
Initial hold (min) 5.2.  10.
Final hold (min)   13.13.1.
I 1640.1652.1617.1642.1638.
ReferenceKarioti, Hadjipavlou-Litina, et al., 2004Mardarowicz, Wianowska, et al., 2004Raina, Kumar, et al., 2004Raina, Kumar, et al., 2004bin Ahmad and bin Jantan, 2003
Comment MSDC-RI MSDC-RI MSDC-RI MSDC-RI MSDC-RI
Column type CapillaryCapillaryCapillaryCapillaryCapillary
Active phase DB-5BP-1BP-1DB-1SPB-1
Column length (m) 30.50.50.30.30.
Carrier gas HeHeHeN2He
Substrate
Column diameter (mm) 0.250.220.220.250.2
Phase thickness (μm) 0.250.250.250.250.2
Tstart (C) 60.60.60.50.70.
Tend (C) 240.230.230.200.220.
Heat rate (K/min) 3.2.2.5.3.
Initial hold (min)
Final hold (min)  35.35.0.15.
I 1642.1638.1638.1624.1616.
ReferenceBader, Flamini, et al., 2003Bianchini, Tomi, et al., 2003Bianchini, Tomi, et al., 2003Boyom, Assembe, et al., 2003Cavaleiro, Salgueiro, et al., 2003
Comment MSDC-RI MSDC-RI MSDC-RI MSDC-RI MSDC-RI
Column type CapillaryCapillaryCapillaryCapillaryCapillary
Active phase HP-5DB-1DB-1HP-5HP-5
Column length (m) 30.30.30.30.30.
Carrier gas N2HeHeHe
Substrate
Column diameter (mm) 0.250.250.250.250.25
Phase thickness (μm) 0.250.250.250.25
Tstart (C) 60.40.40.60.25.
Tend (C) 220.250.250.280.150.
Heat rate (K/min) 5.2.2.3.3.
Initial hold (min) 10.5.5. 5.
Final hold (min)  20.
I 1642.1606.1616.1640.1639.
ReferenceDural, Bagci, et al., 2003de Feo, Bruno, et al., 2003de Feo, Urrunaga Soria, et al., 2003Fokialakis, Melliou, et al., 2003Isidorov, Vinogorova, et al., 2003
Comment MSDC-RI MSDC-RI MSDC-RI MSDC-RI MSDC-RI
Column type CapillaryCapillaryCapillaryCapillaryCapillary
Active phase HP-5HP-1RTX-5HP-5SPB-1
Column length (m) 30.30.30.30.30.
Carrier gas HeHeHeHeHe
Substrate
Column diameter (mm) 0.250.250.250.250.20
Phase thickness (μm) 0.250.330.250.250.20
Tstart (C) 60.40.45.60.70.
Tend (C) 240.260.250.280.220.
Heat rate (K/min) 3.2.3.4.3.
Initial hold (min)  5.6.5.
Final hold (min)  20.  15.
I 1642.1628.1648.1635.1619.
ReferenceMacchioni, Cioni, et al., 2003Senatore, Rigano, et al., 2003Shellie, Marriott, et al., 2003Skaltsa, Demetzos, et al., 2003Cavaleiro, Salgueiro, et al., 2002
Comment MSDC-RI MSDC-RI MSDC-RI MSDC-RI MSDC-RI
Column type CapillaryCapillaryCapillaryCapillaryCapillary
Active phase HP-5MSRTX-5HP-1SPB-5CP Sil 5 CB
Column length (m) 30.30.24.30.30.
Carrier gas  HeHeHeH2
Substrate
Column diameter (mm) 0.250.250.320.250.25
Phase thickness (μm) 0.250.250.170.250.25
Tstart (C) 50.45.60.60.60.
Tend (C) 280.300.250.250.280.
Heat rate (K/min) 3.3.4.4.2.
Initial hold (min) 5.6.2.2.10.
Final hold (min)  10.20.20.40.
I 1640.1645.1621.1640.1628.
ReferenceDemetzos, Angelopoulou, et al., 2002Mondello, Zappia, et al., 2002Nath, Sarma, et al., 2002Pino, Marbot, et al., 2002Pino, Marbot, et al., 2002, 2
Comment MSDC-RI MSDC-RI MSDC-RI MSDC-RI MSDC-RI
Column type CapillaryCapillaryCapillaryCapillaryCapillary
Active phase CP Sil 5 CBCP Sil 5 CBHP-5DB-5DB-5
Column length (m) 50.50.30.30.30.
Carrier gas HeHeHeHeH2
Substrate
Column diameter (mm) 0.320.320.250.250.25
Phase thickness (μm) 0.40.40.25 0.25
Tstart (C) 60.60.60.50.60.
Tend (C) 280.280.380.250.240.
Heat rate (K/min) 3.3.3.3.3.
Initial hold (min) 10.10.
Final hold (min) 60.60.
I 1628.1633.1633.1643.1643.
ReferencePino, Marbot, et al., 2002, 3Pino, Marbot, et al., 2002, 3Couladis, Tsortanidou, et al., 2001Isidorov, Zenkevich, et al., 2001Nogueira, Bittrich, et al., 2001
Comment MSDC-RI MSDC-RI MSDC-RI MSDC-RI MSDC-RI
Column type CapillaryCapillaryCapillaryCapillaryCapillary
Active phase CP Sil 5 CBHP-5HP-5MSBP-1OV-101
Column length (m) 50.30.30.50.25.
Carrier gas HeHeHeHeN2
Substrate
Column diameter (mm) 0.320.250.250.220.25
Phase thickness (μm) 0.4 0.250.25
Tstart (C) 60.50.60.60.50.
Tend (C) 280.200.280.230.200.
Heat rate (K/min) 3.4.4.2.5.
Initial hold (min) 10.1.5.
Final hold (min) 60.  35.
I 1633.1640.1635.1629.1636.
ReferencePino, Marbot, et al., 2001Shalit, Katzir, et al., 2001Skaltsa, Mavrommati, et al., 2001Lota, de Rocca Serra, et al., 2000Menut, Bessiere, et al., 2000
Comment MSDC-RI MSDC-RI MSDC-RI MSDC-RI MSDC-RI
Column type CapillaryCapillaryCapillaryCapillaryCapillary
Active phase HP-5CBP-1DB-1OV-1DB-5
Column length (m) 30.30.30.25.30.
Carrier gas HeHe  H2
Substrate
Column diameter (mm) 0.250.250.250.250.25
Phase thickness (μm) 0.25 0.250.30.25
Tstart (C) 70.60.50.50.60.
Tend (C) 230.240.220.200.240.
Heat rate (K/min) 2.4.3.3.3.
Initial hold (min)   3.1.
Final hold (min)    20.
I 1628.1627.1605.1608.1641.
ReferenceSong, Sawamura, et al., 2000Zunino, Lopez, et al., 2000Muselli, Hoi, et al., 1999Bicchi, Rubiolo, et al., 1998Nogueira, Marsaioli, et al., 1998
Comment MSDC-RI MSDC-RI MSDC-RI MSDC-RI MSDC-RI
Column type CapillaryCapillaryCapillary
Active phase BP-1OV-1BP-1
Column length (m) 50.25.50.
Carrier gas HeH2He
Substrate
Column diameter (mm) 0.220.250.22
Phase thickness (μm) 0.250.30.25
Tstart (C) 60.50.60.
Tend (C) 220.200.230.
Heat rate (K/min) 2.3.2.
Initial hold (min)  1.
Final hold (min) 20.20.35.
I 1634.1612.1640.
ReferenceTam, An, et al., 1998Bicchi, Fresia, et al., 1997Mariotti, Costa, et al., 1997
Comment MSDC-RI MSDC-RI MSDC-RI

Normal alkane RI, non-polar column, custom temperature program

Data compiled by: NIST Mass Spectrometry Data Center, William E. Wallace, director

Column type CapillaryCapillaryCapillaryCapillaryCapillary
Active phase DB-1Polydimethyl siloxane with 5 % Ph groupsHP-5 MSHP-5 MSHP-5 MS
Column length (m) 30.30.30.30.30.
Carrier gas HydrogenHeliumHeliumHeliumHelium
Substrate
Column diameter (mm) 0.250.250.250.250.25
Phase thickness (μm) 0.250.250.250.250.25
Program 45 0C 3 0C/min -> 175 0C 15 0C/min -> 300 0C (10 min)50 0C 4 0C/min -> 200 0C (5 min) 20 0C/min -> 280 0Cnot specified40 0C (10 min) 3 0C/min -> 200 0C 2 0C/min -> 220 0C60 0C (1 min) 10 0C/min -> 180 0C (1 min) 20 0C/min -> 280 0C (15 min)
I 1616.1619.1616.1639.1640.
ReferenceAlbano, Lima, et al., 2012da Silva, de Souza, et al., 2012Feizbakhsh and Naeemy, 2011Nance and Setzer, 2011Liu, Chu, et al., 2010
Comment MSDC-RI MSDC-RI MSDC-RI MSDC-RI MSDC-RI
Column type CapillaryCapillaryCapillaryCapillaryCapillary
Active phase DB-1-MSDB-5HP-5 MSDB-1HP-5
Column length (m) 60.30.30.30.30.
Carrier gas HeliumHeliumHeliumHydrogenHelium
Substrate
Column diameter (mm) 0.250.250.250.250.25
Phase thickness (μm) 0.250.250.250.250.25
Program not specified50 0C m6 0C/min -> 140 0C 5 0C/min -> 160 0C (1 min) 10 0C/min -> 200 0C40 0C (5 min) 2 0C/min -> 270 0C -> 260 0C (20 min)45 0C 3 0C/min -> 175 0C 15 0C/min -> 300 0C (10 min)not specified
I 1633.1654.1640.1616.1640.
ReferenceTakeoka, Hobbs, et al., 2010Courtois, Paine, et al., 2009Mancini, Arnold, et al., 2009Mendes, Trindade, et al., 2009Isidorov, Lech, et al., 2008
Comment MSDC-RI MSDC-RI MSDC-RI MSDC-RI MSDC-RI
Column type CapillaryCapillaryCapillaryCapillaryCapillary
Active phase CP Sil 8 CBCP Sil 8 CBHP-5MSElite-1DB-1
Column length (m) 30.50.30.30.30.
Carrier gas  HeliumHeHeliumHe
Substrate
Column diameter (mm) 0.250.320.250.320.25
Phase thickness (μm) 0.250.250.250.250.1
Program 60C => 2.5C/min => 170C => 10C/min => 250C (5min)not specified40 0C (2 min) 3 0C/min -> 180 0C (2 min) 15 0C -> 280 0Cnot specified35C => 4C/min => 180C => 10C/min => 250C
I 1640.1640.1651.1640.1640.
ReferenceKristiawan, Sobolik, et al., 2008Kupcinskiene, Stikliene, et al., 2008Ning, Zheng, et al., 2008Raj, Baby, et al., 2008Albuquerque, Vasconcelos Silva, et al., 2007
Comment MSDC-RI MSDC-RI MSDC-RI MSDC-RI MSDC-RI
Column type CapillaryCapillaryCapillaryCapillaryCapillary
Active phase HP-5MSHP-5 MSDB-1HP-5MSHP-5 MS
Column length (m) 30.30.30.30.30.
Carrier gas HeHeliumHeHeHelium
Substrate
Column diameter (mm) 0.250.250.250.250.25
Phase thickness (μm) 0.250.250.250.250.25
Program 40C(10min) => 3C/min => 200C => 2C/min => 220C40 0C (10 min) 3 0C/min -> 200 0C 2 0C/min -> 220 0C45C => 3C/min => 175C => 15C/min => 300C (10min)40C(5min) => 2C/min => 250C(15min) => 10C/min => 270C40 0C (5 min) 2 0C/min -> 250 0C (15 min) 10 0C/min -> 270 0C
I 1639.1641.1616.1640.1640.
ReferenceCole, Haber, et al., 2007Eason and Setzer, 2007Ferreira, Meireles de Sousa, et al., 2007Formisano, Mignola, et al., 2007Formisano, Rigano, et al., 2007
Comment MSDC-RI MSDC-RI MSDC-RI MSDC-RI MSDC-RI
Column type CapillaryCapillaryCapillaryCapillaryCapillary
Active phase DB-1HP-1HP-5 MSHP-5 MSDB-1
Column length (m) 30.30.30.30.30.
Carrier gas H2HeHeliumHeliumHe
Substrate
Column diameter (mm) 0.250.20.250.250.25
Phase thickness (μm) 0.250.330.250.250.25
Program 45 0C 3 0C/min -> 175 0C 15 0C/min -> 300 0C (10 min)60C(5min) => 3C/min => 180C => 20C/min => 280C(10min)40 0C (10 min) 3 0C/min -> 200 0C 2 0C/min -> 220 0C40 0C (10 min) 3 0C/min -> 200 0C 2 0C/min -> 220 0C45C => 3C/min => 175C => 15C/min => 300C(10min)
I 1616.1640.1643.1643.1616.
ReferenceKamatou, Viljoen, et al., 2007Merle, Verdeguer, et al., 2007Moriarity, Bansal, et al., 2007Moriarity, Bansal, et al., 2007Rodrigues, Antunes, et al., 2007
Comment MSDC-RI MSDC-RI MSDC-RI MSDC-RI MSDC-RI
Column type CapillaryCapillaryCapillaryCapillaryCapillary
Active phase HP-5 MSHP-5 MSHP-5MSPolydimethyl siloxaneCP Sil 8 CB
Column length (m) 30. 30. 50.
Carrier gas Helium He He
Substrate
Column diameter (mm) 0.25 0.25 0.32
Phase thickness (μm)     0.25
Program 40 0C (10 min) 3 oC/min -> 200 0C 2 0C/min -> 220 0Cnot specified40C(10min) => 3C/min => 200C => 2C/min => 220Cnot specified60 0C (2 min) 5 0C/min -> 160 0C 10 0C/min -> 250 0C (5 min)
I 1640.1644.1641.1639.1640.
ReferenceSetzer, Stokes, et al., 2007Stokes, Cole, et al., 2007Takaku, Haber, et al., 2007Werka, Boehme, et al., 2007Mockute, Bernotiene, et al., 2006
Comment MSDC-RI MSDC-RI MSDC-RI MSDC-RI MSDC-RI
Column type CapillaryCapillaryCapillaryCapillaryCapillary
Active phase HP-5 MSHP-5 MSHP-5MSSE-52SE-52
Column length (m) 30.30.30.30.30.
Carrier gas HeliumHeliumHeHeHe
Substrate
Column diameter (mm) 0.250.250.250.320.32
Phase thickness (μm) 0.250.250.250.150.15
Program 40 0C (10 min) 3 0C/min -> 200 0C 2 0C/min -> 220 0C40 0C (10 min) 3 0C/min -> 200 0C 2 0C/min -> 220 0C40C(5min) => 2C/min => 250C (15min) => 10C/min => 270C45C => 1C/min => 100C => 5C/min => 250C (10min)45C => 1C/min => 100C => 5C/min => 250C (10min)
I 1642.1640.1640.1640.1640.
ReferenceSchmidt, Noletto, et al., 2006Schmidt, Noletto, et al., 2006Senatore, Apostolides Arnold, et al., 2006Tognolini, Barocelli, et al., 2006Tognolini, Barocelli, et al., 2006
Comment MSDC-RI MSDC-RI MSDC-RI MSDC-RI MSDC-RI
Column type CapillaryCapillaryCapillaryCapillaryCapillary
Active phase DB-5MSCP Sil 8 CBDB-5DB-1DB-5
Column length (m) 30.50.30.30.30.
Carrier gas  HeHeHeHe
Substrate
Column diameter (mm) 0.250.320.250.250.25
Phase thickness (μm) 0.250.250.250.250.25
Program 70C(2min) => 10C/min => 150C(15min) => 5C/min => 240C50C(5min) => 2C/min => 90C => 15C/min => 240C(4min)35C => 4C/min => 180C => 10C/min => 250C45C => 3C/min => 175C => 15C/min => 300C (10min)40C(1min) => 9C/min => 130C => 2C/min => 230C
I 1608.1640.1639.1616.1634.
ReferenceBagci and Baser, 2005Butkienë, Nivinskienë, et al., 2005Cysne, Canuto, et al., 2005Figueiredo, Sim-Sim, et al., 2005Hamm, Bleton, et al., 2005
Comment MSDC-RI MSDC-RI MSDC-RI MSDC-RI MSDC-RI
Column type CapillaryCapillaryCapillaryCapillaryCapillary
Active phase HP-5MSDB-1CP Sil 8 CBOV-1DB-5
Column length (m) 30.30.50.15.30.
Carrier gas  HeHeHeHe
Substrate
Column diameter (mm) 0.250.250.320.3170.25
Phase thickness (μm) 0.250.250.25 0.25
Program 40C(5min) => 3C/min => 90C => 10C/min => 280C45C => 3C/min => 175C => 15C/min => 300C (15min)50C(5min) => 2C/min => 90C => 15C/min => 240C(4min)50C(4min) => 4C/min => 90C => 10C/min => 300C(10min)40C(1min) => 9C/min => 130C => 2C/min => 230C
I 1651.1616.1640.1618.1634.
ReferenceNovak, Draxler, et al., 2005Touafek, Nacer, et al., 2005Butkienë, Nivinskienë, et al., 2004El-Shazly and Hussein, 2004Hamm, Bleton, et al., 2004
Comment MSDC-RI MSDC-RI MSDC-RI MSDC-RI MSDC-RI
Column type CapillaryCapillaryCapillaryCapillaryCapillary
Active phase CP Sil 8 CBDB-1DB-1SE-30DB-1
Column length (m) 50.30.30. 30.
Carrier gas HeHeHelium He
Substrate
Column diameter (mm) 0.320.250.25 0.25
Phase thickness (μm)  0.250.25 0.25
Program 60C(2min) => 5C/min => 160C (1min) => 10C/min => 250C (2min)45C => 3C/min => 175C => 15C/min => 300C (10min)35 0C 4 0C/min -> 180 0C 10 0C/min -> 250 0Cnot specified45C => 3C/min => 175C => 15C/min => 300C (10min)
I 1640.1616.1640.1628.1616.
ReferenceJudpentienë and Mockutë, 2004Miguel, Simões, et al., 2004Silva, Matos, et al., 2004Vinogradov, 2004Faleiro, Miguel, et al., 2003
Comment MSDC-RI MSDC-RI MSDC-RI MSDC-RI MSDC-RI
Column type CapillaryCapillaryCapillaryCapillaryCapillary
Active phase DB-5AT-5CP Sil 8 CBCP Sil 8 CBHP-1
Column length (m) 30.60.50.50.30.
Carrier gas HeHeHeHeHe
Substrate
Column diameter (mm) 0.250.250.320.320.32
Phase thickness (μm) 0.250.25  0.25
Program 40C (1min) => 9C/min => 130C => 2C/min => 230C50 0C 5 0C/min -> 135 0C (1 min) 5 0C/min -> 225 0C (5 min) 5 0C/min -> 260 0C60C(2min) => 5C/min => 160C(1min) => 10C/min => 250C (2min)60C(2min) => 5C/min => 160C(1min) => 10C/min => 250C(2min)40C(3min) => 5C/min => 180C => 15C/min => 240C(15min)
I 1634.1640.1640.1640.1635.
ReferenceHamm, Lesellier, et al., 2003Usai, Atzei, et al., 2003Mockute and Judzentiene, 2002Mockute and Judzentiene, 2002, 2Nogueira and Romano, 2002
Comment MSDC-RI MSDC-RI MSDC-RI MSDC-RI MSDC-RI
Column type CapillaryCapillaryCapillaryCapillaryCapillary
Active phase CP Sil 8 CBDB-5DB-5DB-5DB-1
Column length (m)  30. 30.30.
Carrier gas  He HeH2
Substrate
Column diameter (mm)  0.25 0.250.25
Phase thickness (μm)  0.25  0.25
Program not specified35C => 4C/min => 180C => 20C/min => 280Cnot specifiednot specified40 0C 3 K/min -> 175 0C 15 K/min -> 240 0C (10 min)
I 1630.1609.1626.1643.1616.
ReferenceSchwob, Bessière, et al., 2002Viana, Andrade-Neto, et al., 2002Ferreira, Costantin, et al., 2001Isidorov, Zenkevich, et al., 2001da Silva, Pedro, et al., 2000
Comment MSDC-RI MSDC-RI MSDC-RI MSDC-RI MSDC-RI
Column type CapillaryCapillaryCapillaryCapillaryCapillary
Active phase CP Sil 5 CBDB-1DB-5CP Sil 5 CBCP Sil 5 CB
Column length (m) 25.30.30.25.25.
Carrier gas HeHeN2N2N2
Substrate
Column diameter (mm) 0.390.250.25
Phase thickness (μm)  0.250.250.39
Program not specified45C => 3C/min => 175C => 15C/min => 240C (10min)45C(5min) => 2C/min => 200C => 5C/min => 250Cnot specifiednot specified
I 1639.1616.1645.1638.1632.
ReferenceWeyerstahl, Marschall, et al., 1999Baratta, Dorman, et al., 1998Sanda, Koba, et al., 1998Weyerstahl, Marschall, et al., 1998Weyerstahl, Marschall, et al., 1998, 2
Comment MSDC-RI MSDC-RI MSDC-RI MSDC-RI MSDC-RI
Column type CapillaryCapillaryCapillary
Active phase CP Sil 5 CBPolydimethyl siloxanesDB-1
Column length (m) 25. 30.
Carrier gas N2 H2
Substrate
Column diameter (mm)   0.25
Phase thickness (μm)   0.25
Program not specifiednot specified45 0C 3 0C/min -> 175 0C 15 0C/min -> 240 0C (10 min)
I 1630.1628.1616.
ReferenceWeyerstahl, Marschall, et al., 1997Zenkevich, 1997Barroso, Figueiredo, et al., 1996
Comment MSDC-RI MSDC-RI MSDC-RI

References

Adams, González Elizondo, et al., 2006
Adams, R.P.; González Elizondo, M.S.; González Elizondo, M.; Slinkman, E., DNA fingerprinting and terpenoid analysis of Juniperus blancoi var. huehuentensis (Cupressaceae), a new subalpine variety from Durango, Mexico, Biochem. Syst. Ecol., 2006, 34, 3, 205-211, https://doi.org/10.1016/j.bse.2005.11.004 . [all data]

Hazzit, Baaliouamer, et al., 2006
Hazzit, M.; Baaliouamer, A.; Faleiro, M.L.; Miguel, M.G., Composition of the Essential Oils of Thymus and Origanum Species from Algeria and Their Antioxidant and Antimicrobial Activities, J. Agric. Food Chem., 2006, 54, 17, 6314-6321, https://doi.org/10.1021/jf0606104 . [all data]

Meccia G., Rosquete C., et al., 2006
Meccia G.; Rosquete C.; Rojas L.B.; San Felician A., New labdane derivative from the essential oil of Acalypha plicata Mull.Arg., Flavour Fragr. J., 2006, 21, 3, 559-561, https://doi.org/10.1002/ffj.1679 . [all data]

Mevy, Bessiere, et al., 2006
Mevy, J.P.; Bessiere, J.M.; Rabier, J.; Dherbomez, M.; Ruzzier, M.; Millogo, J.; Viano, J., Composition and antimicrobial activities of the essential oil of Triumfetta rhomboidea Jacq., Flavour Fragr. J., 2006, 21, 1, 80-83, https://doi.org/10.1002/ffj.1511 . [all data]

Raina, Verma, et al., 2006
Raina, V.K.; Verma, S.C.; Dhawan, S.; Khan, M.; Ramesh, S.; Singh, S.C.; Yadav, A.; Srivastava, S.K., Essential oil composition of Murraya exotica from the plains of northern India, Flavour Fragr. J., 2006, 21, 1, 140-142, https://doi.org/10.1002/ffj.1547 . [all data]

Sylvestre, Pichette, et al., 2006
Sylvestre, M.; Pichette, A.; Longtin, A.; Nagau, F.; Legault, J., Essential oil analysis and anticancer activity of leaf essential oil of Croton flavens L. from Guadeloupe, J. Ethnopharmacol., 2006, 103, 1, 99-102, https://doi.org/10.1016/j.jep.2005.07.011 . [all data]

Tayoub, Schwob, et al., 2006
Tayoub, G.; Schwob, I.; Bessiere, J.-M.; Masotti, V.; Rabier, J.; Ruzzier, M.; Viano, J., Composition of volatile oils of Styrax (Styrax officinalis L.) leaves at different phenological stages, Biochem. Syst. Ecol., 2006, 34, 9, 705-709, https://doi.org/10.1016/j.bse.2006.05.008 . [all data]

Tayoub, Schwob, et al., 2006, 2
Tayoub, G.; Schwob, I.; Bessière, J.-M.; Rabier, J.; Masotti, V.; J.; M.; Girard, G.; Viano, J., Essential oil composition of leaf, flower and stem of Styrax (Styrax officinalis L.) from south-eastern France, Flavour Fragr. J., 2006, 21, 5, 809-812, https://doi.org/10.1002/ffj.1731 . [all data]

Adams, Morris, et al., 2005
Adams, R.P.; Morris, J.A.; Pandey, R.N.; Schwarzbach, A.E., Cryptic speciation between Juniperus deltoides and Juniperus oxycedrus (Cupressaceae) in the Mediterranean, Biochem. Syst. Ecol., 2005, 33, 8, 771-787, https://doi.org/10.1016/j.bse.2005.01.001 . [all data]

Adams and Nguyen, 2005
Adams, R.P.; Nguyen, S., Infra-specific variation in Juniperus deppeana and F. Sperryi in the Davis Mountains of Texas: variation in leaf essential oils and random amplified polymorphic DNAS (RAPDS), Phytologia, 2005, 87, 2, 96-108. [all data]

Baranauskiene, Venskutonis, et al., 2005
Baranauskiene, R.; Venskutonis, R.P.; Demyttenaere, J.C.R., Sensory and instrumental evaluation of sweet marjoram (Origanum majorana L.) aroma, Flavour Fragr. J., 2005, 20, 5, 492-500, https://doi.org/10.1002/ffj.1478 . [all data]

Avato, Raffo, et al., 2004
Avato, P.; Raffo, F.; Aldouri, N.A.; Vartanian, S.T., Essential oils of varthemia iphionoides from Jordan, Flavour Fragr. J., 2004, 19, 6, 559-561, https://doi.org/10.1002/ffj.1351 . [all data]

Ogunwande, Olawore, et al., 2004
Ogunwande, I.A.; Olawore, N.O.; Adeleke, K.A.; Ekundayo, O.; König, W.A., Rare terpenoid esters from Hyparrhenia rufa (Nees) Stapf. growing wild in Nigeria, Flavour Fragr. J., 2004, 19, 3, 239-243, https://doi.org/10.1002/ffj.1295 . [all data]

Palmeira, Moura, et al., 2004
Palmeira, S.F., Jr.; Moura, F.S.; Alves, V.L.; de Oliveira, F.M.; Bento, E.S.; Conserva, L.M.; Andrade, E.H.A., Neutral components from hexane extracts of Croton sellowii, Flavour Fragr. J., 2004, 19, 1, 69-71, https://doi.org/10.1002/ffj.1298 . [all data]

Siani, Garrido, et al., 2004
Siani, A.C.; Garrido, I.S.; Monteiro, S.S.; Carvalho, E.S.; Ramos, M.F.S., Protium icicariba as a source of volatile essences, Biochem. Syst. Ecol., 2004, 32, 5, 477-489, https://doi.org/10.1016/j.bse.2003.11.003 . [all data]

Amparo Blázquez, Pérez, et al., 2003
Amparo Blázquez, M.; Pérez, I.; Boira, H., Essential oil analysis of Teucrium libanitis and T. turredanum by GC and GC-MS, Flavour Fragr. J., 2003, 18, 6, 497-501, https://doi.org/10.1002/ffj.1256 . [all data]

Baranauskiene, Venskutonis, et al., 2003
Baranauskiene, R.; Venskutonis, P.R.; Viskelis, P.; Dambrauskiene, E., Influence of nitrogen fertilizers on the yield and composition of thyme (Thymus vulgaris), J. Agric. Food Chem., 2003, 51, 26, 7751-7758, https://doi.org/10.1021/jf0303316 . [all data]

Lucero, Estell, et al., 2003
Lucero, M.E.; Estell, R.E.; Frederickson, E.L., The essential oil composition of Psorothamnus scoparius (A. Gray) Rydb., J. Essent. Oil Res., 2003, 15, 2, 108-111, https://doi.org/10.1080/10412905.2003.9712083 . [all data]

Ogunwande, Olawore, et al., 2003
Ogunwande, I.A.; Olawore, N.O.; Adeleke, K.A.; Ekundayo, O.; Koenig, W.A., Chemical composition of the leaf volatile oil of Psidium guajava L. growing in Nigeria, Flavour Fragr. J., 2003, 18, 2, 136-138, https://doi.org/10.1002/ffj.1175 . [all data]

Viña and Murillo, 2003
Viña, A.; Murillo, E., Essential oil composition from twelve varieties of basil (Ocimum spp) grown in Columbia, J. Braz. Chem. Soc., 2003, 14, 5, 744-749, https://doi.org/10.1590/S0103-50532003000500008 . [all data]

Jayaprakasha, Rao, et al., 2002
Jayaprakasha, G.K.; Rao, L.J.; Sakariah, K.K., Chemical composition of volatile oil from Cinnamomum zeylanicum buds, Z. Naturforsch. C:, 2002, 57c, 990-993, retrieved from http://www.znaturforsch.com/57c/s57c0990.pdf. [all data]

Mita, Tsitsimpikou, et al., 2002
Mita, E.; Tsitsimpikou, C.; Tsiveleka, L.; Petrakis, P.V.; Ortiz, A.; Vagias, C.; Roussis, V., Seasonal Variation of Oleoresin Terpenoids from Pinus halepensis and Pinus pinea and Host Selection of the Scale Insect Marchalina hellenica (Homoptera, Coccoidea, Margarodidae, Coelostonidiinae), Holzforschung, 2002, 56, 6, 572-578, https://doi.org/10.1515/HF.2002.087 . [all data]

Raina, Lal, et al., 2002
Raina, V.K.; Lal, R.K.; Tripathi, S.; Khan, M.; Syamasundar, K.V.; Srivastava, S.K., Erratum. Essential oil composition of genetically diverse stocks of Murraya koenigii from India, Flavour Fragr. J., 2002, 17, 5, 404, https://doi.org/10.1002/ffj.1139 . [all data]

Raina, Srivastava, et al., 2002
Raina, V.K.; Srivastava, S.K.; Syamasunder, K.V., The essential oil of 'greater galangal' [Alpinia galanga (L.) Willd.] from the lower Himalayan region of India, Flavour Fragr. J., 2002, 17, 5, 358-360, https://doi.org/10.1002/ffj.1105 . [all data]

Raina, Srivastava, et al., 2002, 2
Raina, V.K.; Srivastava, S.K.; Jain, N.; Ahmad, A.; Syamasundar, K.V.; Aggarwal, K.K., Essential oil composition of Curcuma longa L. cv. Roma from the plains of northern India, Flavour Fragr. J., 2002, 17, 2, 99-102, https://doi.org/10.1002/ffj.1053 . [all data]

Shawl, Srivastava, et al., 2002
Shawl, A.S.; Srivastava, S.K.; Syamasundar, K.V.; Tripathi, S.; Raina, V.K., Essential oil composition of Achillea millefolium L. growing wild in Kashmir, India, Flavour Fragr. J., 2002, 17, 3, 165-168, https://doi.org/10.1002/ffj.1074 . [all data]

Gudzic, Dordevic, et al., 2001
Gudzic, B.; Dordevic, S.; Palic, R.; Stojanovic, G., Essential oils of Hypericum olympicum L. and Hypericum perforatum L., Flavour Fragr. J., 2001, 16, 3, 201-203, https://doi.org/10.1002/ffj.978 . [all data]

Jain, Aggarwal, et al., 2001
Jain, N.; Aggarwal, K.K.; Syamasundar, K.V.; Srivastava, S.K.; Kumar, S., Essential oil composition of geranium (Pelargonium sp.) from the plains of Northern India, Flavour Fragr. J., 2001, 16, 1, 44-46, https://doi.org/10.1002/1099-1026(200101/02)16:1<44::AID-FFJ943>3.0.CO;2-X . [all data]

Jain, Srivastava, et al., 2001
Jain, N.; Srivastava, S.K.; Aggarwal, K.K.; Ramesh, S.; Kumar, S., Essential oil composition of Zanthoxylum alatum seeds from northern India, Flavour Fragr. J., 2001, 16, 6, 408-410, https://doi.org/10.1002/ffj.1024 . [all data]

Palá-Paúl, Velasco-Negueruela, et al., 2001
Palá-Paúl, J.; Velasco-Negueruela, A.; Pérez-Alonso, M.J.; Sanz, J., Analysis of the volatile components of Argyranthemum adauctum (Link.) Humphries by gas chromatography-mass spectrometry, J. Chromatogr. A, 2001, 923, 1-2, 295-298, https://doi.org/10.1016/S0021-9673(01)01003-2 . [all data]

Raina, Srivastava, et al., 2001
Raina, V.K.; Srivastava, S.K.; Aggarwal, K.K.; Syamasundar, K.V.; Kumar, S., Essential oil composition of Syzygium aromaticum leaf from Little Andaman, India, Flavour Fragr. J., 2001, 16, 5, 334-336, https://doi.org/10.1002/ffj.1005 . [all data]

Raina, Srivastava, et al., 2001, 2
Raina, V.K.; Srivastava, S.K.; Aggarwal, K.K.; Ramesh, S.; Kumar, S., Essential oil composition of Cinnamomum zeylanicum Blume leaves from Little Andaman, India, Flavour Fragr. J., 2001, 16, 5, 374-376, https://doi.org/10.1002/ffj.1016 . [all data]

Senatore and Rigano, 2001
Senatore, F.; Rigano, D., Essential oil of two Lippia spp. (Verbenaceae) growing wild in Guatemala, Flavour Fragr. J., 2001, 16, 3, 169-171, https://doi.org/10.1002/ffj.972 . [all data]

Adams, 2000
Adams, R.P., Systematics of smooth leaf margin Juniperus of the western hemisphere based on leaf essential oils and RAPD DNA fingerprinting, Biochem. Syst. Ecol., 2000, 28, 2, 149-162, https://doi.org/10.1016/S0305-1978(99)00047-2 . [all data]

Adams, 2000, 2
Adams, R.P., Systematics of Juniperus section Juniperus based on leaf essential oils and random amplified polymorphic DNAs (RAPDs), Biochem. Syst. Ecol., 2000, 28, 6, 515-528, https://doi.org/10.1016/S0305-1978(99)00089-7 . [all data]

Adams, 2000, 3
Adams, R.P., Systematics of the one seeded Juniperus of the eastern hemisphere based on leaf essential oils and random amplified polymorphic DNAs (RAPDs), Biochem. Syst. Ecol., 2000, 28, 6, 529-543, https://doi.org/10.1016/S0305-1978(99)00096-4 . [all data]

Adams, 2000, 4
Adams, R.P., The serrate leaf margined Juniperus (Section Sabina) of the western hemisphere: systematics and evolution based on leaf essential oils and Random Amplified Polymorphic DNAs (RAPDs), Biochem. Syst. Ecol., 2000, 28, 10, 975-989, https://doi.org/10.1016/S0305-1978(00)00022-3 . [all data]

Roussis, Tsoukatou, et al., 2000
Roussis, V.; Tsoukatou, M.; Petrakis, P.V.; Chinou, I.; Skoula, M.; Harborne, J.B., Volatile constituents of four Helichrysum species growing in Greece, Biochem. Syst. Ecol., 2000, 28, 2, 163-175, https://doi.org/10.1016/S0305-1978(99)00046-0 . [all data]

Tzakou, Harvala, et al., 2000
Tzakou, O.; Harvala, C.; Galati, E.M.; Sanogo, R., Essential oil composition of Nepeta argolica Borey et Chaub. subsp. argolica, Flavour Fragr. J., 2000, 15, 2, 115-118, https://doi.org/10.1002/(SICI)1099-1026(200003/04)15:2<115::AID-FFJ877>3.0.CO;2-9 . [all data]

Adams, 1999
Adams, R.P., Systematics of multi-seeded eastern hemisphere Juniperus based on leaf essential oils and RAPD DNA fingerprinting, Biochem. Syst. Ecol., 1999, 27, 7, 709-725, https://doi.org/10.1016/S0305-1978(99)00016-2 . [all data]

Senatore and de Feo, 1999
Senatore, F.; de Feo, V., Chemical composition of the essential oil from Tagetes mandonii Sch. Bip. (Asteraceae), Flavour Fragr. J., 1999, 14, 1, 32-34, https://doi.org/10.1002/(SICI)1099-1026(199901/02)14:1<32::AID-FFJ772>3.0.CO;2-7 . [all data]

Siani, Ramos, et al., 1999
Siani, A.C.; Ramos, M.F.S.; Menezes-de-Lima, O., Jr.; Ribeiro-dos-Santos, R.; Fernadez-Ferreira, E.; Soares, R.O.A.; Rosas, E.C.; Susunaga, G.S.; Guimarães, A.C.; Zoghbi, M.G.B.; Henriques, M.G.M.O., Evaluation of anti-inflammatory-related activity of essential oils from the leaves and resin of species of Protium, J. Ethnopharmacol., 1999, 66, 1, 57-69, https://doi.org/10.1016/S0378-8741(98)00148-2 . [all data]

da Silva, Andrade, et al., 1999
da Silva, M.H.L.; Andrade, E.H.A.; Zoghbi, M.G.B.; Luz, A.I.R.; da Silva, J.D.; Maia, J.G.S., The essential oils of Lantana camara L. occurring in North Brazil, Flavour Fragr. J., 1999, 14, 4, 208-210, https://doi.org/10.1002/(SICI)1099-1026(199907/08)14:4<208::AID-FFJ811>3.0.CO;2-F . [all data]

da Silva, Zoghbi, et al., 1999
da Silva, M.H.L.; Zoghbi, M.G.B.; Andrade, E.H.A.; Maia, J.G.S., The essential oils of Peperomia pellucida Kunth and P. circinnata link var. circinnata, Flavour Fragr. J., 1999, 14, 5, 312-314, https://doi.org/10.1002/(SICI)1099-1026(199909/10)14:5<312::AID-FFJ835>3.0.CO;2-B . [all data]

Senatore, Urrunaga Soria, et al., 1998
Senatore, F.; Urrunaga Soria, E.; Urrunaga Soria, R.; Porta, G.D.; de Feo, V., Essential oil from two peruvian Satureja species, Flavour Fragr. J., 1998, 13, 1, 1-4, https://doi.org/10.1002/(SICI)1099-1026(199801/02)13:1<1::AID-FFJ672>3.0.CO;2-4 . [all data]

Senatore, 1998
Senatore, F., Volatile constituents of Minthostachys setosa (Briq.) Epl. (Lamiaceae) from Peru, Flavour Fragr. J., 1998, 13, 4, 263-265, https://doi.org/10.1002/(SICI)1099-1026(1998070)13:4<263::AID-FFJ738>3.0.CO;2-H . [all data]

Jayaprakasha, Jaganmohan Rao, et al., 1997
Jayaprakasha, G.K.; Jaganmohan Rao, L.; Sakariah, K.K., Chemical composition of the volatile oil from the fruits of Cinnamomum zeylanicum blume, Flavour Fragr. J., 1997, 12, 5, 331-333, https://doi.org/10.1002/(SICI)1099-1026(199709/10)12:5<331::AID-FFJ663>3.0.CO;2-X . [all data]

Senatore, Urrunaga Soria, et al., 1997
Senatore, F.; Urrunaga Soria, E.; Urrunaga Soria, R.; Porta, G.D.; Taddeo, R.; de Feo, V., Essential oil of Eremocharis triradiata (Wolff.) Johnston (Apiaceae) growing wild in Perú, Flavour Fragr. J., 1997, 12, 4, 257-259, https://doi.org/10.1002/(SICI)1099-1026(199707)12:4<257::AID-FFJ645>3.0.CO;2-4 . [all data]

Tellez, Estell, et al., 1997
Tellez, M.R.; Estell, R.E.; Fredrickson, E.L.; Havstad, K.M., Essential oil of Dyssodia acerosa DC., J. Agric. Food Chem., 1997, 45, 8, 3276-3278, https://doi.org/10.1021/jf9701502 . [all data]

Loayza, Abujder, et al., 1995
Loayza, I.; Abujder, D.; Aranda, R.; Jakupovic, J.; Collin, G.; Deslauriers, H.; Jean, F.-I., Essential oils of Baccharis salicifolia, B. latifolia and B. dracunculifolia, Phytochemistry, 1995, 38, 2, 381-389, https://doi.org/10.1016/0031-9422(94)00628-7 . [all data]

Menut, Lamaty, et al., 1995
Menut, C.; Lamaty, G.; Bessiere, J.-M.; Seuleiman, A.M.; Fendero, P.; Maidou, E.; Denamganai, J., Aromatic Plants of Tropical Central Africa. XXI. Chemical Composition of Bark Essential Oil of Guarea cedrata (A. Chev.) Pellegr. from Central African Republic, J. Essent. Oil Res., 1995, 7, 2, 207-209, https://doi.org/10.1080/10412905.1995.9698502 . [all data]