1,1'-Diphenyl-1,1'-bicyclopentyl

Gas phase thermochemistry data

Data compiled by: Hussein Y. Afeefy, Joel F. Liebman, and Stephen E. Stein

Quantity Value Units Method Reference Comment
Δfgas26.6 ± 0.53kcal/molCcbKratt, Beckhaus, et al., 1983ΔHfussion = 7.5±0.1 kcal/mol at 141°C

Condensed phase thermochemistry data

Data compiled as indicated in comments:
ALS - Hussein Y. Afeefy, Joel F. Liebman, and Stephen E. Stein
DH - Eugene S. Domalski and Elizabeth D. Hearing

Quantity Value Units Method Reference Comment
Δfsolid-7.17 ± 0.24kcal/molCcbKratt, Beckhaus, et al., 1983ΔHfussion = 7.5±0.1 kcal/mol at 141°C; ALS
Quantity Value Units Method Reference Comment
Δcsolid-2950.05 ± 0.24kcal/molCcbKratt, Beckhaus, et al., 1983ΔHfussion = 7.5±0.1 kcal/mol at 141°C; Corresponding Δfsolid = -7.17 kcal/mol (simple calculation by NIST; no Washburn corrections); ALS

Constant pressure heat capacity of solid

Cp,solid (cal/mol*K) Temperature (K) Reference Comment
89.75298.Kratt, Beckhaus, et al., 1983, 2Cp given as 0.309 cal/g*K.; DH

Phase change data

Data compiled as indicated in comments:
TRC - Thermodynamics Research Center, NIST Boulder Laboratories, Chris Muzny director
ALS - Hussein Y. Afeefy, Joel F. Liebman, and Stephen E. Stein
DRB - Donald R. Burgess, Jr.
AC - William E. Acree, Jr., James S. Chickos

Quantity Value Units Method Reference Comment
Tfus414.KN/AKratt, Beckhaus, et al., 1983, 2Uncertainty assigned by TRC = 1. K; TRC
Quantity Value Units Method Reference Comment
Δsub33.8kcal/molEKratt, Beckhaus, et al., 1983ΔHfussion = 7.5±0.1 kcal/mol at 141°C; ALS
Δsub33.70kcal/molN/AKratt, Beckhaus, et al., 1983DRB

Enthalpy of sublimation

ΔsubH (kcal/mol) Temperature (K) Method Reference Comment
33.80141.4E,BKratt, Beckhaus, et al., 1983, 2AC

Enthalpy of fusion

ΔfusH (kcal/mol) Temperature (K) Method Reference Comment
7.500414.DSCKratt, Beckhaus, et al., 1983, 2AC

In addition to the Thermodynamics Research Center (TRC) data available from this site, much more physical and chemical property data is available from the following TRC products:

References

Kratt, Beckhaus, et al., 1983
Kratt, G.; Beckhaus, H.D.; Bernlohr, W.; Ruchardt, C., Thermolabile kohlenwasserstoffe. XVII. Verbrennungsenthalpie und bildungsenthalpie von zehn sym.-tetraalkyl-1,2-diarylethanen, Thermochim. Acta, 1983, 62, 279-194. [all data]

Kratt, Beckhaus, et al., 1983, 2
Kratt, G.; Beckhaus, H.D.; Bernioehr, W.; Ruechardt, C., Thermolabile hydrocarbons. XVII. Enthalpies of combustion and formation of ten sym-tetraalkyl-1,2-diarylethanes, Thermochim. Acta, 1983, 62, 279-294. [all data]