Spiro[2,4]hepta-4,6-diene,1,2-diethyl

Gas phase ion energetics data

Data compiled by: Sharon G. Lias, Rhoda D. Levin, and Sherif A. Kafafi

Ionization energy determinations

IE (eV) Method Reference Comment
8.20PEBischof, Gleiter, et al., 1976Vertical value

References

Bischof, Gleiter, et al., 1976
Bischof, P.; Gleiter, R.; Durr, H.; Ruge, B.; Herbst, P., Das Photoelektronenspektrum von 1,2-Diathylspiro[2.4]hepta-1,4,6-trien. Beispiel fur eine π-σ-*Wechselwirkung, Chem. Ber., 1976, 109, 1412. [all data]