2-Tridecanone

Normal alkane RI, non-polar column, temperature ramp

Data compiled by: NIST Mass Spectrometry Data Center, William E. Wallace, director

Column type CapillaryCapillaryCapillaryCapillaryCapillary
Active phase HP-5 MSDB-5BP-1SPB-5DB-5
Column length (m) 30.30.50.60.30.
Carrier gas HeliumHeliumHelium Nitrogen
Substrate
Column diameter (mm) 0.250.250.220.320.25
Phase thickness (μm) 0.250.250.251.000.25
Tstart (C) 70.40.60.40.60.
Tend (C) 290.240.220.230.220.
Heat rate (K/min) 5.3.2.3.5.
Initial hold (min)  1. 5.3.
Final hold (min) 10. 20.10.5.
I 1498.1498.1478.1500.1489.
ReferenceRadulovic, Blagojevic, et al., 2010de Souza, Lopes, et al., 2010Ottavioli, Bighelli, et al., 2009Sivadier, Ratel, et al., 2009Soleimani and Azar, 2009
Comment MSDC-RI MSDC-RI MSDC-RI MSDC-RI MSDC-RI
Column type CapillaryCapillaryCapillaryCapillaryCapillary
Active phase DB-5DB-5DB-1BP-1SPB-1
Column length (m) 30.30.30.50.30.
Carrier gas Helium   Helium
Substrate
Column diameter (mm) 0.250.250.250.220.20
Phase thickness (μm) 0.250.250.150.250.20
Tstart (C) 40.60.60.60.70.
Tend (C) 240.230.220.220.220.
Heat rate (K/min) 3.3.3.2.3.
Initial hold (min) 1.
Final hold (min)    20.15.
I 1498.1479.1495.1475.1474.
Referencede Souza, Lopes, et al., 2009Kobayashi, Kagawa, et al., 2008Ouattara, Koudou, et al., 2007Boti, Yao, et al., 2006Cavaleiro, Pinto, et al., 2006
Comment MSDC-RI MSDC-RI MSDC-RI MSDC-RI MSDC-RI
Column type CapillaryCapillaryCapillaryCapillaryCapillary
Active phase CP Sil 5 CBUltra-2HP-1HP-5MSRTX-1
Column length (m) 30.50.50.30.30.
Carrier gas N2HeHeHeN2
Substrate
Column diameter (mm) 0.320.250.20.250.32
Phase thickness (μm) 0.250.320.50.250.25
Tstart (C) 50.50.60.60.60.
Tend (C) 300.270.250.280.300.
Heat rate (K/min) 4.2.2.3.4.
Initial hold (min)    5.
Final hold (min)   60.
I 1480.1497.1474.1500.1483.
ReferenceLis and Milczarek, 2006Schlumpberger B.O., Clery R.A., et al., 2006Bendimerad and Bendiab, 2005Setzer, Noletto, et al., 2005Lis, Boczek, et al., 2004
Comment MSDC-RI MSDC-RI MSDC-RI MSDC-RI MSDC-RI
Column type CapillaryCapillaryCapillaryCapillaryCapillary
Active phase DB-5SPB-5DB-5DB-1SPB-5
Column length (m) 30.60.30.30.60.
Carrier gas  HeliumHeHeHe
Substrate
Column diameter (mm) 0.250.320.250.20.25
Phase thickness (μm) 0.251.00.25 0.25
Tstart (C) 40.30.60.60.70.
Tend (C) 210.230.250.240.240.
Heat rate (K/min) 2.3.3.3.5.
Initial hold (min) 2.   8.
Final hold (min) 33.   20.
I 1502.1494.1489.1501.01521.
ReferenceLopez Arze, Collin, et al., 2004Sebastian, Viallon-Fernandez, et al., 2003Limberger, Simões-Pires, et al., 2002Santos, Moreira, et al., 2001Kim, Kim, et al., 2000
Comment MSDC-RI MSDC-RI MSDC-RI MSDC-RI MSDC-RI
Column type CapillaryCapillaryCapillaryCapillaryCapillary
Active phase SE-54Cross-Linked MethylsiliconeUltra-2DB-1DB-1
Column length (m) 25.25.50.30.30.
Carrier gas  HeHeHeHe
Substrate
Column diameter (mm) 0.310.320.320.250.25
Phase thickness (μm)   0.520.250.25
Tstart (C) 35.35.40.50.50.
Tend (C) 250.225.250.240.240.
Heat rate (K/min) 4.4.4.5.5.
Initial hold (min) 3.3.3.3.3.
Final hold (min)   30.
I 1487.1476.1516.1473.1479.
ReferenceDing, Deng, et al., 1998Bravo and Hotchkiss, 1993King, Hamilton, et al., 1993Shiota, 1993Shiota, 1993
Comment MSDC-RI MSDC-RI MSDC-RI MSDC-RI MSDC-RI
Column type CapillaryCapillaryCapillaryCapillary
Active phase DB-5Ultra-1OV-101SE-30
Column length (m) 60.25.54.10.
Carrier gas  HeHelium
Substrate
Column diameter (mm) 0.250.320.260.25
Phase thickness (μm) 0.250.25
Tstart (C) 40.80.50.20.
Tend (C) 250.260.240.200.
Heat rate (K/min) 2.3.5.4.
Initial hold (min) 5. 0.
Final hold (min)   0.
I 1496.1475.1491.1468.
ReferenceLee, Macku, et al., 1991Okumura, 1991Zenkevich and Ventura, 1991Yaacob, Abdullah, et al., 1989
Comment MSDC-RI MSDC-RI MSDC-RI MSDC-RI

Phase change data

Data compiled as indicated in comments:
BS - Robert L. Brown and Stephen E. Stein
TRC - Thermodynamics Research Center, NIST Boulder Laboratories, Chris Muzny director
AC - William E. Acree, Jr., James S. Chickos

Quantity Value Units Method Reference Comment
Tboil536.2KN/AWeast and Grasselli, 1989BS
Tboil528.15KN/ADakin, 1910Uncertainty assigned by TRC = 2. K; TRC
Tboil535.65KN/AMasson, 1909Uncertainty assigned by TRC = 2. K; TRC
Tboil535.9KN/AKrafft, 1882Uncertainty assigned by TRC = 2. K; TRC
Tboil536.15KN/AKrafft, 1879Uncertainty assigned by TRC = 2. K; TRC
Quantity Value Units Method Reference Comment
Tc717.0KN/APulliam, Gude, et al., 1995Uncertainty assigned by TRC = 3. K; TRC
Quantity Value Units Method Reference Comment
ρc1.22mol/lN/APulliam, Gude, et al., 1995Uncertainty assigned by TRC = 0.04 mol/l; TRC

Reduced pressure boiling point

Tboil (K) Pressure (bar) Reference Comment
407.20.013Aldrich Chemical Company Inc., 1990BS
433.20.021Weast and Grasselli, 1989BS

Enthalpy of vaporization

ΔvapH (kJ/mol) Temperature (K) Method Reference Comment
69.6350.AStephenson and Malanowski, 1987Based on data from 335. - 534. K.; AC
61.439.AStephenson and Malanowski, 1987Based on data from 424. - 510. K.; AC
49.6541.N/AAmbrose, Ellender, et al., 1975Based on data from 400. - 628. K.; AC
69.8348.EBMeyer and Wagner, 1966Based on data from 335. - 431. K.; AC
62.1375.N/AStull, 1947Based on data from 360. - 535. K.; AC

Antoine Equation Parameters

log10(P) = A − (B / (T + C))
    P = vapor pressure (bar)
    T = temperature (K)

View plot Requires a JavaScript / HTML 5 canvas capable browser.

Temperature (K) A B C Reference Comment
360.0 - 535.75.288822638.443-36.70Stull, 1947Coefficents calculated by NIST from author's data.

In addition to the Thermodynamics Research Center (TRC) data available from this site, much more physical and chemical property data is available from the following TRC products:

Normal alkane RI, polar column, temperature ramp

Data compiled by: NIST Mass Spectrometry Data Center, William E. Wallace, director

Column type CapillaryCapillaryCapillaryCapillaryCapillary
Active phase InnowaxDB-WaxHP-WaxTC-FFAPBP-20
Column length (m) 30.30.30. 50.
Carrier gas   N2He
Substrate
Column diameter (mm) 0.250.250.250.250.22
Phase thickness (μm) 0.250.500.250.250.25
Tstart (C) 40.60.50.60.60.
Tend (C) 200.230.250.220.220.
Heat rate (K/min) 10.3.5.3.2.
Initial hold (min) 5.
Final hold (min) 15. 10.30.20.
I 1807.1845.1793.1818.1808.
ReferenceKaypak and Avsar, 2008Kobayashi, Kagawa, et al., 2008Fredj, Marzouk, et al., 2007Kurose, Okamura, et al., 2007Boti, Yao, et al., 2006
Comment MSDC-RI MSDC-RI MSDC-RI MSDC-RI MSDC-RI
Column type CapillaryCapillaryCapillaryCapillaryCapillary
Active phase InnowaxTC-FFAPSupelcowax-10Supelcowax-10HP-FFAP
Column length (m) 50.60.60.30.25.
Carrier gas HeHeHe
Substrate
Column diameter (mm) 0.20.250.530.250.32
Phase thickness (μm) 0.50.41.0.250.52
Tstart (C) 60.60.40.40.60.
Tend (C) 250.220.240.210.240.
Heat rate (K/min) 2.3.4.2.5.
Initial hold (min)   2.2.1.
Final hold (min) 60.30.20.33.5.
I 1786.1818.1836.1813.1793.
ReferenceBendimerad and Bendiab, 2005Kurose and Yatagai, 2005Rochat and Chaintreau, 2005Lopez Arze, Collin, et al., 2004Qian and Reineccius, 2002
Comment MSDC-RI MSDC-RI MSDC-RI MSDC-RI MSDC-RI
Column type CapillaryCapillaryCapillaryCapillaryCapillary
Active phase DB-WaxCP-Wax 52CBSupelcowax-10DB-WaxCP-Wax 52CB
Column length (m) 60.50.30.30.25.
Carrier gas HeHeHe He
Substrate
Column diameter (mm) 0.250.300.320.530.32
Phase thickness (μm)  0.250.25 0.2
Tstart (C) 40.40.70.60.60.
Tend (C) 220.220.240.210.240.
Heat rate (K/min) 2.3.5.4.6.
Initial hold (min)  5.8. 2.
Final hold (min)   20. 10.
I 1828.1792.1801.1805.1802.
ReferenceJiang and Kubota, 2001Chagonda, Makanda, et al., 2000Kim, Kim, et al., 2000Iwatsuki, Mizota, et al., 1999Chisowa, Hall, et al., 1998
Comment MSDC-RI MSDC-RI MSDC-RI MSDC-RI MSDC-RI
Column type CapillaryCapillaryCapillaryCapillaryCapillary
Active phase DB-WaxCarbowax 20MCarbowax 20MSP-1000DB-Wax
Column length (m) 60.50.50.25.60.
Carrier gas H2HeHeN2
Substrate
Column diameter (mm) 0.320.250.250.20.32
Phase thickness (μm) 0.25  0.43
Tstart (C) 60.60.60.60.50.
Tend (C) 220.180.180.190.250.
Heat rate (K/min) 3.2.2.4.4.
Initial hold (min)  4.4. 0.1
Final hold (min)    30.5.
I 1803.1787.1787.1819.1806.
ReferenceWerkhoff, Güntert, et al., 1998Kawakami, Kobayashi, et al., 1993Kawakami and Kobayashi, 1991De Llano D.G., Ramos M., et al., 1990Binder and Flath, 1989
Comment MSDC-RI MSDC-RI MSDC-RI MSDC-RI MSDC-RI

Van Den Dool and Kratz RI, non-polar column, custom temperature program

Data compiled by: NIST Mass Spectrometry Data Center, William E. Wallace, director

Column type CapillaryCapillaryCapillaryCapillaryCapillary
Active phase CP-Sil 8CB-MSDB-1DB-5DB-5BPX-5
Column length (m) 60.60.30.30.50.
Carrier gas HeHeH2H2He
Substrate
Column diameter (mm) 0.250.250.250.250.32
Phase thickness (μm) 0.250.250.250.250.5
Program 0C(5min) => 40C/min => 40C (2min) => 4C/min => 280C-20C (5min) => 10C/min => 100C => 4C/min => 200C => 10C/min => 280C40C(5min) => 2C/min => 220C => 5C/min => 250C(15min)40C(5min) => 2C/min => 220C => 5C/min => 250C(15min)OC => 60C/min => 60C(5min) => 4C/min => 250C(20min)
I 1499.1477.1494.1496.1512.
ReferenceElmore, Mottram, et al., 2000Eri, Khoo, et al., 2000Boulanger, Chassagne, et al., 1999Boulanger, Chassagne, et al., 1999Owens J.D., Allagheny N., et al., 1997
Comment MSDC-RI MSDC-RI MSDC-RI MSDC-RI MSDC-RI

Normal alkane RI, non-polar column, isothermal

Data compiled by: NIST Mass Spectrometry Data Center, William E. Wallace, director

Column type Capillary
Active phase OV-1
Column length (m)
Carrier gas
Substrate
Column diameter (mm)
Phase thickness (μm)
Temperature (C) 60.
I 1470.
ReferenceAmboni, Junkes, et al., 2002
Comment MSDC-RI

Van Den Dool and Kratz RI, polar column, custom temperature program

Data compiled by: NIST Mass Spectrometry Data Center, William E. Wallace, director

Column type Capillary
Active phase Supelcowax-10
Column length (m) 60.
Carrier gas He
Substrate
Column diameter (mm) 0.25
Phase thickness (μm) 0.25
Program 20C(0.5min) => 60C => 4C/min => 250C
I 1797.
ReferenceSing, Smadja, et al., 1992
Comment MSDC-RI

References

Radulovic, Blagojevic, et al., 2010
Radulovic, N.; Blagojevic, P.; Palic, R., Comparative study of the leaf volatiles of Arctostaphylos uva-ursi (L.) Spreng. and Vaccinium vitis-idaea L. (Ericaceae), Molecules, 2010, 15, 9, 6168-6185, https://doi.org/10.3390/molecules15096168 . [all data]

de Souza, Lopes, et al., 2010
de Souza, A.; Lopes, E.M.C.; da Silva, M.C.; Cordeiro, I.; Young, M.C.M.; Sobral, M.E.G.; Moreno, P.R.H., Chemical composition and acetylcholinesterase inhibitory activity of essential oils of Myrceugenia myrciolides (Cambess.) O. Berg and Eugenia riedelliana O. Berg, Myrtaceae, Braz. J. Pharmacognosy, 2010, 20, 2, 175-179. [all data]

Ottavioli, Bighelli, et al., 2009
Ottavioli, J.; Bighelli, A.; Casanova, J.; Bang, B.T.; Y., GC (retention indices), GC-MS, and 13C NMR of two citral-rich Cymbopogon leaf oils: C. Flexuosus and C. tortilis, Spectroscopy Lett., 2009, 42, 8, 506-512, https://doi.org/10.1080/00387010903022350 . [all data]

Sivadier, Ratel, et al., 2009
Sivadier, G.; Ratel, J.; Engel, E., Latency and persistence of diet volatile biomarkers in lamb fats, J. Agric. Food Chem., 2009, 57, 2, 645-652, https://doi.org/10.1021/jf802467q . [all data]

Soleimani and Azar, 2009
Soleimani, M.; Azar, P.A., Volatile composition of Ruta graveolens L. of North of Iran, World Appl. Sci. J., 2009, 7, 1, 124-126. [all data]

de Souza, Lopes, et al., 2009
de Souza, A.; Lopes, E.M.C.; da Silva, M.C.; Cordeiro, I.; Young, M.C.M.; Sobral, M.E.G.; Moreno, P.R.H., Chemical composition and acetylcholinesterase inhibitory activity of essential oils of Myrceugenia myrcioides (Chambess.) O. Berg and Eugenia riedeliana O. Berg, Myrtaceae, Braz. J. Pharmacognosy, 2009, 20, 2, 175-179. [all data]

Kobayashi, Kagawa, et al., 2008
Kobayashi, A.; Kagawa, S.; Ishikawa, H.; Matsubara, H.; Matsui, T.; Matsumoto, K., Identification of plastic off-odor from linear-low density polyethylene, Nippon Hoso Gakkaishi, 2008, 17, 6, 427-432. [all data]

Ouattara, Koudou, et al., 2007
Ouattara, L.; Koudou, J.; Obame, L.C.E.; Karou, D.S.; Traore, A.; Bessiere, J.M., Chemical composition and antibacterial activity of Cochlospermum planchoni Hook. f. ex Planch essential oil from Burkina Faso, Pakistan J. Biol. Sci., 2007, 10, 22, 4177-4179, https://doi.org/10.3923/pjbs.2007.4177.4179 . [all data]

Boti, Yao, et al., 2006
Boti, J.B.; Yao, P.A.; Koukoua, G.; N'Guessan, T.Y.; Casanova, J., Components and chemical variability of Isolona campanulata Engler Diels leaf oil, Flavour Fragr. J., 2006, 21, 1, 166-170, https://doi.org/10.1002/ffj.1555 . [all data]

Cavaleiro, Pinto, et al., 2006
Cavaleiro, C.; Pinto, E.; Gonsales, M.J.; Salguero, L., Antifungal activity of Juniperus essential oils agains dermatophyte, Asrgillus and Candida strains, J. Appl. Microbiol., 2006, 100, 6, 1333-1338, https://doi.org/10.1111/j.1365-2672.2006.02862.x . [all data]

Lis and Milczarek, 2006
Lis, A.; Milczarek, J., Chemical composition of the essential oils from fruits, leaves and flowers of Phellodendron sachalinense (Fr. Schmidt) Sarg., Flavour Fragr. J., 2006, 21, 4, 683-686, https://doi.org/10.1002/ffj.1662 . [all data]

Schlumpberger B.O., Clery R.A., et al., 2006
Schlumpberger B.O.; Clery R.A.; Barthlott W., A unique cactus with scented and possibly bat-dispersed fruits: Rhipsalis juengeri, Plant Biology, 2006, 8, 2, 265-270, https://doi.org/10.1055/s-2005-873045 . [all data]

Bendimerad and Bendiab, 2005
Bendimerad, N.; Bendiab, S.A.T., Composition and antibacterial activity of Pseudocytisus integrifolius (Salisb.) essential oil from Algeria, J. Agric. Food Chem., 2005, 53, 8, 2947-2952, https://doi.org/10.1021/jf047937u . [all data]

Setzer, Noletto, et al., 2005
Setzer, W.N.; Noletto, J.A.; Lawton, R.O.; Haber, W.A., Leaf essential oil composition of five Zanthoxylum species from Monteverde, Costa Rica, Molecular Diversity, 2005, 9, 1-3, 3-13, https://doi.org/10.1007/s11030-005-1298-6 . [all data]

Lis, Boczek, et al., 2004
Lis, A.; Boczek, E.; Góra, J., Chemical composition of the essential oils from fruits, leaves and flowers of the Amur cork tree (Phellodendron amurense Rupr.), Flavour Fragr. J., 2004, 19, 6, 549-553, https://doi.org/10.1002/ffj.1349 . [all data]

Lopez Arze, Collin, et al., 2004
Lopez Arze, J.B.; Collin, G.; Garneau, F.-X.; Jean, F.-I.; Gagnon, H., Essential oils from Bolivia. II. Asteraceae: Ophryosporus heptanthus (Wedd.) H. Rob. et King, J. Essent. Oil Res., 2004, 16, 4, 374-376, https://doi.org/10.1080/10412905.2004.9698747 . [all data]

Sebastian, Viallon-Fernandez, et al., 2003
Sebastian, I.; Viallon-Fernandez, C.; Berge, P.; Berdague, J.-L., Analysis of the volatile fraction of lamb fat tissue: influence of the type of feeding, Sciences des Aliments, 2003, 23, 4, 497-511, https://doi.org/10.3166/sda.23.497-511 . [all data]

Limberger, Simões-Pires, et al., 2002
Limberger, R.P.; Simões-Pires, C.; Sobral, M.; Menu, C.; Bessiere, J.-M.; Henriques, A.T., Essential oils from some Myrceugenia species (Myrtaceae), Flavour Fragr. J., 2002, 17, 5, 341-344, https://doi.org/10.1002/ffj.1113 . [all data]

Santos, Moreira, et al., 2001
Santos, P.R.; Moreira, D.L.; Guimaraes, E.F.; Kaplan, M.A.C., Essential oil analysis of 10 piperaceae species from the Brazilian Atlantic forest, Phytochemistry, 2001, 58, 4, 547-551, https://doi.org/10.1016/S0031-9422(01)00290-4 . [all data]

Kim, Kim, et al., 2000
Kim, H.-J.; Kim, K.; Kim, N.-S.; Lee, D.-S., Determination of floral fragrances of Rosa hybrida using solid-phase trapping-solvent extraction and gas chromatography-mass spectrometry, J. Chromatogr. A, 2000, 902, 2, 389-404, https://doi.org/10.1016/S0021-9673(00)00863-3 . [all data]

Ding, Deng, et al., 1998
Ding, Q.; Deng, Y.; Sun, Y.; Huagn, A.; Sun, Y., Analysis of volatile components in ox feces by capillary gas chromatography, Beijing Daxue Xuebao Ziran Kexueban, 1998, 34, 6, 720-725. [all data]

Bravo and Hotchkiss, 1993
Bravo, A.; Hotchkiss, J.H., Identification of volatile compounds resulting from the thermal oxidation of polyethylene, J. Appl. Polym. Sci., 1993, 47, 10, 1741-1748, https://doi.org/10.1002/app.1993.070471004 . [all data]

King, Hamilton, et al., 1993
King, M.-F.; Hamilton, B.L.; Matthews, M.A.; Rule, D.C.; Field, R.A., Isolation and identification of volatiles and condensable material in raw beef with supercritical carbon dioxide extraction, J. Agric. Food Chem., 1993, 41, 11, 1974-1981, https://doi.org/10.1021/jf00035a030 . [all data]

Shiota, 1993
Shiota, H., New esteric components in the volatiles of banana fruit (Musa sapientum L.), J. Agric. Food Chem., 1993, 41, 11, 2056-2062, https://doi.org/10.1021/jf00035a046 . [all data]

Lee, Macku, et al., 1991
Lee, S.-R.; Macku, C.; Shibamoto, T., Isolation and identification of headspace volatiles formed in heated butter, J. Agric. Food Chem., 1991, 39, 11, 1972-1975, https://doi.org/10.1021/jf00011a017 . [all data]

Okumura, 1991
Okumura, T., retention indices of environmental chemicals on methyl silicone capillary column, Journal of Environmental Chemistry (Japan), 1991, 1, 2, 333-358, https://doi.org/10.5985/jec.1.333 . [all data]

Zenkevich and Ventura, 1991
Zenkevich, I.G.; Ventura, K., Gas Chromatographic Identification of Volatile Products of Thermal Degradation of Bitumen, Zh. Prikl. Khim. (Rus.), 1991, 9, 1974-1979. [all data]

Yaacob, Abdullah, et al., 1989
Yaacob, K.B.; Abdullah, C.M.; Joulain, D., Essential Oil of Ruta graveolens L., J. Essent. Oil Res., 1989, 1, 5, 203-207, https://doi.org/10.1080/10412905.1989.9697787 . [all data]