2-Furanmethanethiol, 5-methyl-

Van Den Dool and Kratz RI, non-polar column, custom temperature program

Data compiled by: NIST Mass Spectrometry Data Center, William E. Wallace, director

Column type CapillaryCapillary
Active phase SE-54SE-54
Column length (m) 30.30.
Carrier gas  He
Substrate
Column diameter (mm) 0.320.32
Phase thickness (μm) 0.250.25
Program 35C(2min) => 40C/min => 50C(5min) => 6C/min => 230C(15min)40C (2min) => 40C/min => 50C (5min) => 6C/min => 230C (15min)
I 995.995.
ReferenceHofmann and Schieberle, 1998Hofmann and Schieberle, 1997
Comment MSDC-RI MSDC-RI

Normal alkane RI, polar column, temperature ramp

Data compiled by: NIST Mass Spectrometry Data Center, William E. Wallace, director

Column type CapillaryCapillary
Active phase DB-WaxCarbowax 20M
Column length (m) 60.50.
Carrier gas HeHe
Substrate
Column diameter (mm) 0.250.25
Phase thickness (μm)
Tstart (C) 40.70.
Tend (C) 200.180.
Heat rate (K/min) 2.2.
Initial hold (min) 2.
Final hold (min)
I 1497.1473.
ReferenceUmano, Hagi, et al., 1995Tressl and Silwar, 1981
Comment MSDC-RI MSDC-RI

References

Hofmann and Schieberle, 1998
Hofmann, T.; Schieberle, P., Identification of key aroma compounds generated from cysteine and carbohydrates under roasting conditions, Z. Lebensm. Unters. Forsch. A, 1998, 207, 3, 229-236, https://doi.org/10.1007/s002170050324 . [all data]

Hofmann and Schieberle, 1997
Hofmann, T.; Schieberle, P., Identification of potent aroma compounds in thermally treated mixtures of glucose/cysteine and rhamnose/cysteine using aroma extract dilution techniques, J. Agric. Food Chem., 1997, 45, 3, 898-906, https://doi.org/10.1021/jf960456t . [all data]