4-Octene

Normal alkane RI, non-polar column, temperature ramp

Data compiled by: NIST Mass Spectrometry Data Center, William E. Wallace, director

Column type Capillary
Active phase HP-5
Column length (m) 60.
Carrier gas He
Substrate
Column diameter (mm) 0.32
Phase thickness (μm) 1.
Tstart (C) 40.
Tend (C) 240.
Heat rate (K/min) 3.
Initial hold (min)
Final hold (min)
I 806.
ReferenceGarcía, Martín, et al., 2000
Comment MSDC-RI

References

García, Martín, et al., 2000
García, C.; Martín, A.; Timón, M.L.; Córdoba, J.J., Microbial populations and volatile compounds in the 'bone taint' spoilage of dry cured ham, Lett. Appl. Microbiol., 2000, 30, 1, 61-66, https://doi.org/10.1046/j.1472-765x.2000.00663.x . [all data]