3,3,4,4-Tetrafluoro-1-butanol

Gas phase thermochemistry data

Data compiled by: Hussein Y. Afeefy, Joel F. Liebman, and Stephen E. Stein

Quantity Value Units Method Reference Comment
Δfgas  CmAndreevskii and Antonova, 1982uncertain value: -251.3 kcal/mol

References

Andreevskii and Antonova, 1982
Andreevskii, D.N.; Antonova, Z.A., Development of an increment scheme for calculating the thermodynamic properties of organic polyfluoro compounds, J. Appl. Chem. USSR, 1982, 55, 582-587. [all data]