Nikethamide

Gas phase ion energetics data

Data evaluated as indicated in comments:
HL - Edward P. Hunter and Sharon G. Lias

Data compiled as indicated in comments:
LLK - Sharon G. Lias, Rhoda D. Levin, and Sherif A. Kafafi

Quantity Value Units Method Reference Comment
Proton affinity (review)224.9kcal/molN/AHunter and Lias, 1998HL
Quantity Value Units Method Reference Comment
Gas basicity217.3kcal/molN/AHunter and Lias, 1998HL

Ionization energy determinations

IE (eV) Method Reference Comment
8.65PEDougherty, Younathan, et al., 1978LLK

Phase change data

Data compiled by: Robert L. Brown and Stephen E. Stein

Quantity Value Units Method Reference Comment
Tboil571.2KN/AAldrich Chemical Company Inc., 1990

References

Hunter and Lias, 1998
Hunter, E.P.; Lias, S.G., Evaluated Gas Phase Basicities and Proton Affinities of Molecules: An Update, J. Phys. Chem. Ref. Data, 1998, 27, 3, 413-656, https://doi.org/10.1063/1.556018 . [all data]

Dougherty, Younathan, et al., 1978
Dougherty, D.; Younathan, E.S.; Voll, R.; Abdulnur, S.; McGlynn, S.P., Photoelectron spectroscopy of some biological molecules, J. Electron Spectrosc. Relat. Phenom., 1978, 13, 379. [all data]