Propane, 1,1'-thiobis[2-methyl-

Gas phase thermochemistry data

Data compiled by: Hussein Y. Afeefy, Joel F. Liebman, and Stephen E. Stein

Quantity Value Units Method Reference Comment
Δfgas-42.9 ± 0.5kcal/molCcbMackle and Mayrick, 1962

Condensed phase thermochemistry data

Data compiled by: Hussein Y. Afeefy, Joel F. Liebman, and Stephen E. Stein

Quantity Value Units Method Reference Comment
Δfliquid-54.8 ± 0.4kcal/molCcbMackle and Mayrick, 1962
Quantity Value Units Method Reference Comment
Δcliquid-1456.30 ± 0.37kcal/molCcbMackle and Mayrick, 1962

Phase change data

Data compiled as indicated in comments:
BS - Robert L. Brown and Stephen E. Stein
TRC - Thermodynamics Research Center, NIST Boulder Laboratories, Chris Muzny director
AC - William E. Acree, Jr., James S. Chickos
ALS - Hussein Y. Afeefy, Joel F. Liebman, and Stephen E. Stein
DRB - Donald R. Burgess, Jr.

Quantity Value Units Method Reference Comment
Tboil445. - 446.KN/ABuckingham and Donaghy, 1982BS
Tboil445.2KN/ALecat, 1947Uncertainty assigned by TRC = 0.6 K; TRC
Tboil447.KN/AMann and Purdie, 1935Uncertainty assigned by TRC = 2. K; TRC
Quantity Value Units Method Reference Comment
Tfus167.65KN/ATimmermans and Mattaar, 1921Uncertainty assigned by TRC = 0.5 K; TRC
Quantity Value Units Method Reference Comment
Δvap11.64kcal/molN/AMajer and Svoboda, 1985
Δvap11.6kcal/molN/AShimizu, Saito, et al., 1981AC
Δvap11.6 ± 0.2kcal/molGCMackle and McClean, 1964AC
Δvap11.9 ± 0.4kcal/molVMackle and Mayrick, 1962ALS
Δvap12.0kcal/molN/AMackle and Mayrick, 1962DRB

Enthalpy of vaporization

ΔvapH (kcal/mol) Temperature (K) Method Reference Comment
11.1335.AStephenson and Malanowski, 1987Based on data from 325. - 346. K. See also Dykyj, Svoboda, et al., 1999.; AC
10.3336.EBMackle and Mayrick, 1962, 2Based on data from 326. - 346. K.; AC

In addition to the Thermodynamics Research Center (TRC) data available from this site, much more physical and chemical property data is available from the following TRC products:

Gas phase ion energetics data

Data compiled as indicated in comments:
LLK - Sharon G. Lias, Rhoda D. Levin, and Sherif A. Kafafi
RDSH - Henry M. Rosenstock, Keith Draxl, Bruce W. Steiner, and John T. Herron

Ionization energy determinations

IE (eV) Method Reference Comment
8.32CTSAloisi, Santini, et al., 1974LLK
8.36 ± 0.05EIKhvostenko and Furlei, 1968RDSH

References

Mackle and Mayrick, 1962
Mackle, H.; Mayrick, R.G., Studies in the thermochemistry of organic sulphides. Part 2. The gas-phase heats of formation of ten aliphatic sulphides, Trans. Faraday Soc., 1962, 58, 230-237. [all data]

Buckingham and Donaghy, 1982
Buckingham, J.; Donaghy, S.M., Dictionary of Organic Compounds: Fifth Edition, Chapman and Hall, New York, 1982, 1. [all data]

Lecat, 1947
Lecat, M., Orthobaric Azeotropes of Sulfides, Bull. Cl. Sci., Acad. R. Belg., 1947, 33, 160-82. [all data]

Mann and Purdie, 1935
Mann, F.G.; Purdie, D., The Constitution of Complex Metallic Salts III. The Parachors of Palladium and Mercury in Simple and Complex Compounds, J. Chem. Soc., 1935, 1935, 1549. [all data]

Timmermans and Mattaar, 1921
Timmermans, J.; Mattaar, J.F., Freezing points of orgainic substances VI. New experimental determinations., Bull. Soc. Chim. Belg., 1921, 30, 213. [all data]

Majer and Svoboda, 1985
Majer, V.; Svoboda, V., Enthalpies of Vaporization of Organic Compounds: A Critical Review and Data Compilation, Blackwell Scientific Publications, Oxford, 1985, 300. [all data]

Shimizu, Saito, et al., 1981
Shimizu, M.; Saito, Y.; Kusano, K., , Preprints 17th Conf. Chem. Thermodyn. Thermal Anal., Japan, 1981, 50. [all data]

Mackle and McClean, 1964
Mackle, H.; McClean, R.T.B., Measurement of vaporization heats by the method of gas-liquid chromatography. Part 2, Trans. Faraday Soc., 1964, 60, 817, https://doi.org/10.1039/tf9646000817 . [all data]

Stephenson and Malanowski, 1987
Stephenson, Richard M.; Malanowski, Stanislaw, Handbook of the Thermodynamics of Organic Compounds, 1987, https://doi.org/10.1007/978-94-009-3173-2 . [all data]

Dykyj, Svoboda, et al., 1999
Dykyj, J.; Svoboda, J.; Wilhoit, R.C.; Frenkel, M.L.; Hall, K.R., Vapor Pressure of Chemicals: Part A. Vapor Pressure and Antoine Constants for Hydrocarbons and Sulfur, Selenium, Tellurium and Hydrogen Containing Organic Compounds, Springer, Berlin, 1999, 373. [all data]

Mackle and Mayrick, 1962, 2
Mackle, H.; Mayrick, R.G., Studies in the thermochemistry of organic sulphides. Part 2.?The gas-phase heats of formation of ten aliphatic sulphides, Trans. Faraday Soc., 1962, 58, 230, https://doi.org/10.1039/tf9625800230 . [all data]

Aloisi, Santini, et al., 1974
Aloisi, G.G.; Santini, S.; Sorriso, S., Molecular complexes of substituted diphenyl sulphides with π acceptors. Charge transfer spectra and ionization potentials of the donors, J. Chem. Soc. Faraday Trans. 1, 1974, 70, 1908. [all data]

Khvostenko and Furlei, 1968
Khvostenko, V.I.; Furlei, I.I., Ionisation potentials of sulphides, Zh. Fiz. Khim., 1968, 42, 13, In original 5. [all data]

Bol'shakov, et al., 1969
Bol'shakov, G.F., et al., Ultraviolet spectra of heteroorganic compounds, 1969, 105. [all data]