1-Fluoropentane

Phase change data

Data compiled as indicated in comments:
BS - Robert L. Brown and Stephen E. Stein
AC - William E. Acree, Jr., James S. Chickos

Quantity Value Units Method Reference Comment
Tboil336.0KN/AWeast and Grasselli, 1989BS

Enthalpy of vaporization

ΔvapH (kJ/mol) Temperature (K) Method Reference Comment
33.7260.ESTStephenson and Malanowski, 1987Based on data from 245. - 373. K. See also Li and Rossini, 1961 and Dykyj, 1972.; AC

Gas phase ion energetics data

Data compiled by: Henry M. Rosenstock, Keith Draxl, Bruce W. Steiner, and John T. Herron

Appearance energy determinations

Ion AE (eV) Other Products MethodReferenceComment
C2H5+14.67?EILorquet-Julien, 1961
C3H5+14.12?EILorquet-Julien, 1961
C3H6+11.47?EILorquet-Julien, 1961
C3H7+12.02?EILorquet-Julien, 1961
C4H7+11.42?EILorquet-Julien, 1961
C5H10+10.07HFEILorquet-Julien, 1961

References

Weast and Grasselli, 1989
CRC Handbook of Data on Organic Compounds, 2nd Editon, Weast,R.C and Grasselli, J.G., ed(s)., CRC Press, Inc., Boca Raton, FL, 1989, 1. [all data]

Stephenson and Malanowski, 1987
Stephenson, Richard M.; Malanowski, Stanislaw, Handbook of the Thermodynamics of Organic Compounds, 1987, https://doi.org/10.1007/978-94-009-3173-2 . [all data]

Li and Rossini, 1961
Li, J.C.M.; Rossini, F.D., Vapor Pressures and Boiling Points of the l-Fluoroalkanes, l-Chloroalkanes, l-Bromoalkanes, and l-Iodoalkanes, C 1 to C 20 ., J. Chem. Eng. Data, 1961, 6, 2, 268-270, https://doi.org/10.1021/je60010a025 . [all data]

Dykyj, 1972
Dykyj, J., Petrochemia, 1972, 12, 1, 13. [all data]

Lorquet-Julien, 1961
Lorquet-Julien, J.C., Comportement du 1 fluoro- et du 1 chloropentane normal et des derives halogenescorrespondants du cyclopentane sous l'impact electronique, Bull. Soc. Roy. Sci. Liege, 1961, 30, 170. [all data]