N-butyl-2-methylpiperidine

Phase change data

Data compiled by: Thermodynamics Research Center, NIST Boulder Laboratories, Chris Muzny director

Quantity Value Units Method Reference Comment
Tboil460.65KN/AWinans and Adkins, 1932Uncertainty assigned by TRC = 3. K

In addition to the Thermodynamics Research Center (TRC) data available from this site, much more physical and chemical property data is available from the following TRC products:

References

Winans and Adkins, 1932
Winans, C.F.; Adkins, H., The Alkylation of Amines as Catalyzed by Nickel, J. Am. Chem. Soc., 1932, 54, 306. [all data]