2-Propanone, 1-(acetyloxy)-

Normal alkane RI, non-polar column, temperature ramp

Data compiled by: NIST Mass Spectrometry Data Center, William E. Wallace, director

Column type CapillaryCapillaryCapillaryCapillaryCapillary
Active phase ZB-5SLB-5MSHP-5MSSPB-5DB-1
Column length (m) 30.10.30.60.60.
Carrier gas HeliumHeliumHeHeliumHe
Substrate
Column diameter (mm) 0.250.180.250.320.32
Phase thickness (μm) 0.250.180.251.01.
Tstart (C) 40.40.50.30.40.
Tend (C) 280.295.280.230.260.
Heat rate (K/min) 6.10.5.3.2.
Initial hold (min) 1.1.54.
Final hold (min) 9. 10.
I 869.882.876.861.838.
ReferenceHarrison and Priest, 2009Risticevic, Carasek, et al., 2008Kim, Abd El-Aty, et al., 2006Sebastian, Viallon-Fernandez, et al., 2003Chen and Ho, 1999
Comment MSDC-RI MSDC-RI MSDC-RI MSDC-RI MSDC-RI
Column type CapillaryCapillary
Active phase DB-1DB-1
Column length (m) 60.60.
Carrier gas HeHe
Substrate
Column diameter (mm) 0.320.32
Phase thickness (μm) 1.01.0
Tstart (C) 40.40.
Tend (C) 260.280.
Heat rate (K/min) 2.2.
Initial hold (min)
Final hold (min)
I 836.826.
ReferenceChen and Ho, 1998Tai and Ho, 1998
Comment MSDC-RI MSDC-RI

Normal alkane RI, polar column, custom temperature program

Data compiled by: NIST Mass Spectrometry Data Center, William E. Wallace, director

Column type CapillaryCapillaryCapillaryCapillary
Active phase Supelcowax-10DB-WaxDB-WaxCarbowax 20M
Column length (m) 30.30.30.50.
Carrier gas HeliumHydrogenHydrogenN2
Substrate
Column diameter (mm) 0.250.250.250.2
Phase thickness (μm) 0.250.250.250.2
Program 45 0C 3 0C/min -> 230 0C (10 min) 10 0C/min -> 270 0C (21 min)44 0C 3 0C/min -> 170 0C 8 0C/min -> 250 0Cnot specified60C => 2C/min => 150C => 4C/min => 220C
I 1454.1470.1483.1467.
Referencede Simon, Estruelas, et al., 2009Gonzalez-Rios, Suarez-Quiroz, et al., 2007Gonzalez-Rios, Suarez-Quiroz, et al., 2007Teai, Claude-Lafontaine, et al., 2001
Comment MSDC-RI MSDC-RI MSDC-RI MSDC-RI

Phase change data

Data compiled by: Robert L. Brown and Stephen E. Stein

Quantity Value Units Method Reference Comment
Tboil447.KN/AAmerican Tokyo Kasei, 1988

Reduced pressure boiling point

Tboil (K) Pressure (bar) Reference
347.0.024Buckingham and Donaghy, 1982

Reaction thermochemistry data

Data compiled by: John E. Bartmess

Individual Reactions

C5H7O3- + Hydrogen cation = 2-Propanone, 1-(acetyloxy)-

By formula: C5H7O3- + H+ = C5H8O3

Quantity Value Units Method Reference Comment
Δr1466. ± 12.kJ/molG+TSCumming and Kebarle, 1978gas phase
Quantity Value Units Method Reference Comment
Δr1436. ± 8.4kJ/molIMRECumming and Kebarle, 1978gas phase

Gas phase ion energetics data

Data compiled by: John E. Bartmess

De-protonation reactions

C5H7O3- + Hydrogen cation = 2-Propanone, 1-(acetyloxy)-

By formula: C5H7O3- + H+ = C5H8O3

Quantity Value Units Method Reference Comment
Δr1466. ± 12.kJ/molG+TSCumming and Kebarle, 1978gas phase
Quantity Value Units Method Reference Comment
Δr1436. ± 8.4kJ/molIMRECumming and Kebarle, 1978gas phase

References

Harrison and Priest, 2009
Harrison, B.M.; Priest, F.G., Composition of peaks used in the preparation of malt for Scotch Whisky production - influence of geographical source and extraction depth, J. Agric. Food Chem., 2009, 57, 6, 2385-2391, https://doi.org/10.1021/jf803556y . [all data]

Risticevic, Carasek, et al., 2008
Risticevic, S.; Carasek, E.; Pawliszyn, J., Headspace solid-phase microextraction-gas chromatographic-time-of-flight mass spectrometric methodology for geographical origin verification of coffee, Anal. Chim. Acta, 2008, 617, 1-2, 72-84, https://doi.org/10.1016/j.aca.2008.04.009 . [all data]

Kim, Abd El-Aty, et al., 2006
Kim, M.R.; Abd El-Aty, A.M.; Kim, I.S.; Shim, J.H., Determination of volatile flavor components in danggui cultivars by solvent free injection and hydrodistillation followed by gas chromatographic-mass spectrometric analysis, J. Chromatogr. A, 2006, 1116, 1-2, 259-264, https://doi.org/10.1016/j.chroma.2006.03.060 . [all data]

Sebastian, Viallon-Fernandez, et al., 2003
Sebastian, I.; Viallon-Fernandez, C.; Berge, P.; Berdague, J.-L., Analysis of the volatile fraction of lamb fat tissue: influence of the type of feeding, Sciences des Aliments, 2003, 23, 4, 497-511, https://doi.org/10.3166/sda.23.497-511 . [all data]

Chen and Ho, 1999
Chen, J.; Ho, C.-T., Comparison of volatile generation in serine/threonine/glutamine-ribose/glucose/fructose model systems, J. Agric. Food Chem., 1999, 47, 2, 643-647, https://doi.org/10.1021/jf980771a . [all data]

Chen and Ho, 1998
Chen, J.; Ho, C.-T., Volatile compounds generated in serine-monosaccharide model systems, J. Agric. Food Chem., 1998, 46, 4, 1518-1522, https://doi.org/10.1021/jf970934f . [all data]

Tai and Ho, 1998
Tai, C.-Y.; Ho, C.-T., Influence of glutathione oxidation and pH on thermal formation of Maillard-type volatile compounds, J. Agric. Food Chem., 1998, 46, 6, 2260-2265, https://doi.org/10.1021/jf971111t . [all data]