mercury dicyanide
- Formula: C2HgN2
- Molecular weight: 252.62
- CAS Registry Number: 592-04-1

Condensed phase thermochemistry data

Data compiled by: José A. Martinho Simões
Quantity | Value | Units | Method | Reference | Comment |
---|---|---|---|---|---|
ΔfH°solid | 263.6 ± 8.4 | kJ/mol | RSC | Tel'noi and Rabinovich, 1980 | Value corrected based on a set of ancillary data by J.A. Martinho Simões; The enthalpy of formation was quoted from Tel'noi and Rabinovich, 1980 and relies on experimental data in Skinner H.A., 1964. |

Gas phase thermochemistry data

Data compiled by: José A. Martinho Simões
Quantity | Value | Units | Method | Reference | Comment |
---|---|---|---|---|---|
ΔfH°gas | 89.0 ± 2.2 | kcal/mol | Review | Martinho Simões |

Phase change data

Data compiled by: José A. Martinho Simões
Quantity | Value | Units | Method | Reference | Comment |
---|---|---|---|---|---|
ΔsubH° | 26.0 ± 1.0 | kcal/mol | RSC | Skinner H.A., 1964 |

References

Tel'noi and Rabinovich, 1980
Tel'noi, V.I.; Rabinovich, I.B.,
Russ. Chem. Rev., 1980, 49, 603. [all data]
Skinner H.A., 1964
Skinner H.A.,
In Advances in Organometallic Chemistry; Vol. 2, Academic Press, New York, 1964. [all data]