Phenol, 2-methoxy-4-(1-propenyl)-, acetate, (E)-

Kovats' RI, non-polar column, isothermal

View large format table.

Column type Active phase Temperature (C) I Reference Comment
CapillarySE-30100.1534.4Tudor, 199740. m/0.35 mm/0.35 μm

Van Den Dool and Kratz RI, non-polar column, custom temperature program

View large format table.

Column type Active phase I Reference Comment
CapillaryHP-51617.Isidorov, Krajewska, et al., 200130. m/0.25 mm/0.25 μm, He; Program: 50C => 6C/min => 100C => 4C/min => 280C

References

Tudor, 1997
Tudor, E., Temperature dependence of the retention index for perfumery compounds on a SE-30 glass capillary column. I. Linear equations, J. Chromatogr. A, 1997, 779, 1-2, 287-297, https://doi.org/10.1016/S0021-9673(97)00453-6 . [all data]

Isidorov, Krajewska, et al., 2001
Isidorov, V.A.; Krajewska, U.; Dubis, E.N.; Jdanova, M.A., Partition coefficients of alkyl aromatic hydrocarbons and esters in a hexane-acetonitrile system, J. Chromatogr. A, 2001, 923, 1-2, 127-136, https://doi.org/10.1016/S0021-9673(01)00929-3 . [all data]