Pentanenitrile, 5-(methylthio)-

Normal alkane RI, non-polar column, temperature ramp

Data compiled by: NIST Mass Spectrometry Data Center, William E. Wallace, director

Column type CapillaryCapillaryCapillaryCapillaryCapillary
Active phase HP-101HP-101HP-1CP Sil 5 CBHP-1
Column length (m) 25.25.50.30.50.
Carrier gas HeliumHeliumHeliumHeHe
Substrate
Column diameter (mm) 0.200.200.200.250.2
Phase thickness (μm) 0.250.250.330.250.5
Tstart (C) 70.70.60.40.60.
Tend (C) 200.200.250.220.220.
Heat rate (K/min) 3.3.2.4.2.
Initial hold (min) 2.2. 1.
Final hold (min)   20. 40.
I 1220.1227.1158.1174.1142.
ReferenceBlazevic and Mastelic, 2008Blazevic and Mastelic, 2008Breme, Langle, et al., 2008Rohloff and Bones, 2005Valette, Fernandez, et al., 2003
Comment MSDC-RI MSDC-RI MSDC-RI MSDC-RI MSDC-RI

References

Blazevic and Mastelic, 2008
Blazevic, I.; Mastelic, J., Free and bounded volatiles of rocket (Eruca sativa Mill.), Fravour Fragr. J., 2008, 23, 4, 278-285, https://doi.org/10.1002/ffj.1883 . [all data]

Breme, Langle, et al., 2008
Breme, K.; Langle, S.; Fernandez, X.; Meierhenrich, U.J.; Brevard, H.; Joulain, D., Character impact odorants from Brassicaceae by aroma extracts dilution analysis (AEDA): Brassica cretica and Brassica insularis, Flavour Fragr. J., 2008, 24, 2, 88-93, https://doi.org/10.1002/ffj.1912 . [all data]

Rohloff and Bones, 2005
Rohloff, J.; Bones, A.M., Volatile profiling of Arabidopsis thaliana - Putative olfactory compounds in plant communication, Phytochemistry, 2005, 66, 16, 1941-1955, https://doi.org/10.1016/j.phytochem.2005.06.021 . [all data]

Valette, Fernandez, et al., 2003
Valette, L.; Fernandez, X.; Poulain, S.; Loiseau, A.-M.; Lizzani-Cuvelier, L.; Levieil, R.; Restier, L., Volatile constituents from Romanesco cauliflower, Food Chem., 2003, 80, 3, 353-358, https://doi.org/10.1016/S0308-8146(02)00272-8 . [all data]