Benzene, 1-bromo-3-iodo-

Condensed phase thermochemistry data

Data compiled by: Eugene S. Domalski and Elizabeth D. Hearing

Constant pressure heat capacity of liquid

Cp,liquid (J/mol*K) Temperature (K) Reference Comment
183.1298.15Narbutt, 1918T = 198 to 373 K. Cp = 0.15134 + 0.0001332t. Cp value calculated from equation.

Phase change data

Data compiled as indicated in comments:
BS - Robert L. Brown and Stephen E. Stein
TRC - Thermodynamics Research Center, NIST Boulder Laboratories, Chris Muzny director
AC - William E. Acree, Jr., James S. Chickos
DH - Eugene S. Domalski and Elizabeth D. Hearing

Quantity Value Units Method Reference Comment
Tfus264.KN/ATimmermans, 1935Uncertainty assigned by TRC = 1.5 K; TRC
Tfus263.85KN/ANarbutt, 1918, 2Uncertainty assigned by TRC = 0.5 K; TRC

Reduced pressure boiling point

Tboil (K) Pressure (bar) Reference Comment
525.21.01Weast and Grasselli, 1989BS
393.20.024Weast and Grasselli, 1989BS
393.0.024American Tokyo Kasei, 1988BS

Enthalpy of fusion

ΔfusH (kJ/mol) Temperature (K) Reference Comment
12.16282.5Acree, 1991AC
12.192263.85Narbutt, 1918DH

Entropy of fusion

ΔfusS (J/mol*K) Temperature (K) Reference Comment
46.2263.85Narbutt, 1918DH

In addition to the Thermodynamics Research Center (TRC) data available from this site, much more physical and chemical property data is available from the following TRC products:

References

Narbutt, 1918
Narbutt, J., Die Spezifischen Warmen und Schmelzwarmen der dichloro-, chlorbrom-, dibrom-, bromjod-, und dijodbenzole. I, Z. Elektrochem., 1918, 24, 339-342. [all data]

Timmermans, 1935
Timmermans, J., Researches in Stoichiometry. I. The Heat of Fusion of Organic Compounds., Bull. Soc. Chim. Belg., 1935, 44, 17-40. [all data]

Narbutt, 1918, 2
Narbutt, J., The specific heats and heats of melting of dichlorobenzene, bromochlorobenzene, dibromobenzene, bromiodobenzene and diiodobenzenes: I, Z. Elektrochem. Angew. Phys. Chem., 1918, 24, 339-42. [all data]

Weast and Grasselli, 1989
CRC Handbook of Data on Organic Compounds, 2nd Editon, Weast,R.C and Grasselli, J.G., ed(s)., CRC Press, Inc., Boca Raton, FL, 1989, 1. [all data]

American Tokyo Kasei, 1988
American Tokyo Kasei, TCI American Organic Chemical 88/89 Catalog, American Tokyo Kasei, Portland, OR, 1988, 1610. [all data]

Acree, 1991
Acree, William E., Thermodynamic properties of organic compounds: enthalpy of fusion and melting point temperature compilation, Thermochimica Acta, 1991, 189, 1, 37-56, https://doi.org/10.1016/0040-6031(91)87098-H . [all data]