2(3H)-Furanone, 5-methyl-

Normal alkane RI, polar column, temperature ramp

Data compiled by: NIST Mass Spectrometry Data Center, William E. Wallace, director

Column type CapillaryCapillary
Active phase DB-WaxCarbowax 20M
Column length (m) 60.50.
Carrier gas HeHe
Substrate
Column diameter (mm) 0.250.33
Phase thickness (μm)
Tstart (C) 40.60.
Tend (C) 200.200.
Heat rate (K/min) 2.3.
Initial hold (min) 2.
Final hold (min)
I 1429.1390.
ReferenceUmano, Hagi, et al., 1995Vernin, Metzger, et al., 1992
Comment MSDC-RI MSDC-RI

Phase change data

Data compiled as indicated in comments:
BS - Robert L. Brown and Stephen E. Stein
AC - William E. Acree, Jr., James S. Chickos

Reduced pressure boiling point

Tboil (K) Pressure (bar) Reference Comment
329.20.016Weast and Grasselli, 1989BS
329.0.016American Tokyo Kasei, 1988BS

Enthalpy of vaporization

ΔvapH (kJ/mol) Temperature (K) Method Reference Comment
40.3339.AStephenson and Malanowski, 1987Based on data from 324. - 442. K.; AC

Reaction thermochemistry data

Data compiled by: Hussein Y. Afeefy, Joel F. Liebman, and Stephen E. Stein

Individual Reactions

dihydro-5-methylenefuran-2(3H)-one = 2(3H)-Furanone, 5-methyl-

By formula: C5H6O2 = C5H6O2

Quantity Value Units Method Reference Comment
Δr-8.5 ± 1.1kJ/molKinTaskinen, 1994liquid phase; solvent: Cyclohexane

Gas phase ion energetics data

Data compiled by: Sharon G. Lias, Rhoda D. Levin, and Sherif A. Kafafi

Ionization energy determinations

IE (eV) Method Reference
9.62 ± 0.05EIThorstad, Undheim, et al., 1975

Kovats' RI, non-polar column, temperature ramp

Data compiled by: NIST Mass Spectrometry Data Center, William E. Wallace, director

Column type CapillaryCapillary
Active phase DB-1DB-1
Column length (m) 60.60.
Carrier gas
Substrate
Column diameter (mm) 0.250.25
Phase thickness (μm) 0.250.25
Tstart (C) 30.30.
Tend (C) 220.220.
Heat rate (K/min) 2.2.
Initial hold (min) 4.4.
Final hold (min)
I 835.836.
ReferenceTakeoka, Perrino, et al., 1996Takeoka, Perrino, et al., 1996
Comment MSDC-RI MSDC-RI

References

Umano, Hagi, et al., 1995
Umano, K.; Hagi, Y.; Nakahara, K.; Shyoji, A.; Shibamoto, T., Volatile chemicals formed in the headspace of a heated D-glucose/L-cysteine Maillard model system, J. Agric. Food Chem., 1995, 43, 8, 2212-2218, https://doi.org/10.1021/jf00056a046 . [all data]

Vernin, Metzger, et al., 1992
Vernin, G.; Metzger, J.; Boniface, C.; Murello, M.-H.; Siouffi, A.; Larice, J.-L.; Parkanyi, C., Kinetics and thermal degradation of the fructose-methionine Amadori intermediates. GC-MS/SPECMA data bank identification of volatile aroma compounds, Carbohyd. Res., 1992, 230, 1, 15-29, https://doi.org/10.1016/S0008-6215(00)90510-X . [all data]