2,4-Nonadienal, (E,E)-

Normal alkane RI, non-polar column, temperature ramp

Data compiled by: NIST Mass Spectrometry Data Center, William E. Wallace, director

Column type CapillaryCapillaryCapillaryCapillaryCapillary
Active phase Optima-5DB-5 MSDB-5 MSHP-5 MSBPX5
Column length (m) 30.30.30.30.25.
Carrier gas HeliumHeliumHeliumHeliumHe
Substrate
Column diameter (mm) 0.250.320.320.250.20
Phase thickness (μm) 0.250.250.250.250.13
Tstart (C) 60.40.40.50.50.
Tend (C) 246.230.250.280.230.
Heat rate (K/min) 3.6.6.4.3.
Initial hold (min) 1.2.2. 2.
Final hold (min)  20.20.
I 1213.1223.1235.1214.1214.
ReferenceAl-Qudah, Muhaidat, et al., 2012Chen, Song, et al., 2009Chen, Song, et al., 2009Zhao, Zeng, et al., 2009Boustie, Rapior, et al., 2005
Comment MSDC-RI MSDC-RI MSDC-RI MSDC-RI MSDC-RI
Column type CapillaryCapillaryCapillaryCapillaryCapillary
Active phase MDN-5MDN-5HP-5SE-54DB-5
Column length (m) 60.60.30.30.30.
Carrier gas HeHeHeliumHeH2
Substrate
Column diameter (mm) 0.250.250.320.0530.32
Phase thickness (μm) 0.250.250.251.51.
Tstart (C) 40.40.40.100.40.
Tend (C) 270.270.300.250.240.
Heat rate (K/min) 4.4.4.5.5.
Initial hold (min) 4.4.
Final hold (min) 5.5.5. 10.
I 1229.1230.1214.1232.1214.
Referencevan Loon, Linssen, et al., 2005van Loon, Linssen, et al., 2005Utsunomia, Kawata, et al., 2005Kilic, Hafizoglu, et al., 2004Landy, Nicklaus, et al., 2004
Comment MSDC-RI MSDC-RI MSDC-RI MSDC-RI MSDC-RI
Column type CapillaryCapillaryCapillaryCapillaryCapillary
Active phase NB-30DB-5DB-5DB-5DB-5
Column length (m) 50.60.30.30.30.
Carrier gas HeHeH2HeHe
Substrate
Column diameter (mm) 0.20.250.30.320.32
Phase thickness (μm) 0.250.250.250.250.25
Tstart (C) 50.35.35.40.40.
Tend (C) 250.280.240.230.230.
Heat rate (K/min) 2.5.8.6.6.
Initial hold (min)  2.2.52.2.
Final hold (min)  4.2.10.10.
I 1222.1211.1193.1216.1216.
ReferenceRaal, Arak, et al., 2004Dhanda, Pegg, et al., 2003Triqui and Bouchriti, 2003Czerny and Schieberle, 2002Czerny and Schieberle, 2002
Comment MSDC-RI MSDC-RI MSDC-RI MSDC-RI MSDC-RI
Column type CapillaryCapillaryCapillaryCapillaryCapillary
Active phase HP-5DB-5RTX-5DB-5MSOptima-1
Column length (m) 30.30.20.30.25.
Carrier gas H2HeHeHeHe
Substrate
Column diameter (mm) 0.320.320.180.530.20
Phase thickness (μm) 0.250.250.41.50.25
Tstart (C) 45.40.20.40.50.
Tend (C) 230.290.290.225.250.
Heat rate (K/min) 3.7.40.6.3.
Initial hold (min) 1. 3.55.3.
Final hold (min) 10. 0.530.
I 1211.1217.1215.1224.1193.
ReferenceDarriet, Pons, et al., 2002Lin, Rouseff, et al., 2002Sies A., Hirsch R., et al., 2002Cadwallader and Heo, 2001de Beck, Bessière, et al., 2000
Comment MSDC-RI MSDC-RI MSDC-RI MSDC-RI MSDC-RI
Column type CapillaryCapillaryCapillaryCapillaryCapillary
Active phase DB-5HP-1SE-54SE-54OV-101
Column length (m)  25.30.30.50.
Carrier gas     N2
Substrate
Column diameter (mm)  0.320.520.520.25
Phase thickness (μm) 0.25 1.51.5
Tstart (C) 34.35.5.5.80.
Tend (C) 200.250.230.230.200.
Heat rate (K/min) 5.4.6.6.2.
Initial hold (min) 3.
Final hold (min) 10.
I 1204.1180.1216.1216.1190.
ReferenceSchlüter, Steinhart, et al., 1999Ong, Acree, et al., 1998Milo and Grosch, 1996Milo and Grosch, 1996Tamura, Nakamoto, et al., 1995
Comment MSDC-RI MSDC-RI MSDC-RI MSDC-RI MSDC-RI
Column type CapillaryPackedCapillaryCapillaryCapillary
Active phase OV-101SE-54DB-1OV-101OV-101
Column length (m) 50.3.60.50.50.
Carrier gas N2  NitrogenNitrogen
Substrate  Chromosorb G AW DMCS (100-120 mesh)
Column diameter (mm) 0.25 0.320.250.25
Phase thickness (μm)
Tstart (C) 80.50.50.70.80.
Tend (C) 200.230.230.200.200.
Heat rate (K/min) 2.6.4.2.2.
Initial hold (min)  2.
Final hold (min)  10.10.
I 1191.1216.1184.1188.1191.
ReferenceTamura, Nakamoto, et al., 1995Schieberle, 1991Binder, Turner, et al., 1990Sugisawa, Nakamura, et al., 1990Sugisawa, Nakamura, et al., 1990
Comment MSDC-RI MSDC-RI MSDC-RI MSDC-RI MSDC-RI
Column type CapillaryCapillaryCapillary
Active phase DB-1OV-1SE-30
Column length (m) 60.50.50.
Carrier gas  Hydrogen
Substrate
Column diameter (mm) 0.320.200.5
Phase thickness (μm)
Tstart (C) 50.50.40.
Tend (C) 250.200.170.
Heat rate (K/min) 4.1.3.
Initial hold (min)   3.
Final hold (min) 5.35.
I 1185.1185.1188.
ReferenceBinder, Flath, et al., 1989Wu, Liou, et al., 1987Heydanek and McGorrin, 1981
Comment MSDC-RI MSDC-RI MSDC-RI

Normal alkane RI, non-polar column, custom temperature program

Data compiled by: NIST Mass Spectrometry Data Center, William E. Wallace, director

Column type CapillaryCapillaryCapillaryCapillaryCapillary
Active phase VF-5VF-5HP-5HP-5 MSHP-5 MS
Column length (m) 30.30.50.30.30.
Carrier gas HeliumHeliumHeliumHeliumHelium
Substrate
Column diameter (mm) 0.250.250.320.250.25
Phase thickness (μm) 0.250.251.050.250.25
Program 50 0C (2 min) 3 0C/min -> 200 0C (3 min) 10 0C/min -> 220 0C (8 min)not specified40 0C (10 min) 5 0C/min -> 200 0C 15 0C/min -> 250 0C (10 min)40 0C (2 min) 4 0C/min -> 220 0C 20 0C/min -> 280 0C40 0C (2 min) 4 0C/min -> 220 0C 20 0C/min -> 280 0C
I 1235.1218.1229.1218.1220.
ReferenceShivashankar, Roy, et al., 2012Shivashankar, Roy, et al., 2012Ventanas, Estevez, et al., 2008Xie, Sun, et al., 2008Xie, Sun, et al., 2008
Comment MSDC-RI MSDC-RI MSDC-RI MSDC-RI MSDC-RI
Column type CapillaryCapillaryCapillaryCapillaryCapillary
Active phase DB-5DB-5SE-54DB-5 MSHP-5
Column length (m) 30.30.30.60.
Carrier gas    HeliumHe
Substrate
Column diameter (mm) 0.250.320.320.32
Phase thickness (μm) 0.250.250.251.0
Program 50C(1min) => 5C/min => 100C => 10C/min => 250C (9min)40C(2min) => 40C/min => 60C(2min) => 6C/min => 180C => 15C/min => 230C(10min)35C(2min) => 40C/min => 60C(2min) => 6C/min => 180C => 10C/min => 230C(10min)40 0C (2 min) 6 0C/min -> 100 0C 4 0C/min -> 180 0C 8 0C/min -> 250 0C (12 min)50C => 3C/min => 200C(10min) => 10C/min => 290C(10min)
I 1216.1215.1215.1218.1223.
ReferenceBeaulieu and Lancaster, 2007Buettner, 2007Lasekan, Buettner, et al., 2007Liu, Xu, et al., 2007Splivallo, Bossi, et al., 2007
Comment MSDC-RI MSDC-RI MSDC-RI MSDC-RI MSDC-RI
Column type CapillaryCapillaryCapillaryCapillaryCapillary
Active phase 5 % Phenyl methyl siloxanePolydimethyl siloxane with 5 % Ph groupsHP-5SE-54DB-5
Column length (m) 30. 50.30.30.
Carrier gas     H2
Substrate
Column diameter (mm) 0.25 0.320.320.3
Phase thickness (μm) 0.75 1.050.250.25
Program 50C(1min) => 5C/min => 100C => 10C/min => 190C => 30C/min => 250C(1min)not specified40C(10min) => 5C/min => 200C => 20C/min => 250C(5min)35C (2min) => 40C/min => 50C (2min) => 6C/min => 180C => 10C/min => 230C (10min)35C (1min) => 40C/min => 60C (5min) => 4C/min => 240C
I 1216.1219.1223.1221.1203.
ReferenceBeaulieu J.C. and Lea J.M., 2006Pino, Marbot, et al., 2005Garcia-Estaban, Ansorena, et al., 2004Buettner, Mestres, et al., 2003Triqui and Bouchriti, 2003
Comment MSDC-RI MSDC-RI MSDC-RI MSDC-RI MSDC-RI
Column type CapillaryCapillaryCapillaryCapillaryCapillary
Active phase DB-5SE-54SE-54SE-54SE-54
Column length (m) 30.30.25.30.30.
Carrier gas He HeHeHe
Substrate
Column diameter (mm) 0.320.320.320.320.32
Phase thickness (μm) 0.250.250.25 0.25
Program 35C(1min) => 40C/min => 60C (1min) => 6C/min => 230C35 0C (2 min) 40 0C/min -> 50 0C (1 min) 6 0C/min -> 230 0C35C(2min) => 50C/min => 60C(2min) => 4C/min => 230C35C => 40C/min => 60C (1min) => 6C/min => 250C35C (2min) => 40C/min => 60C (2min) => 6C/min => 180C => 10C/min => 240C
I 1213.1215.1216.1218.1215.
ReferenceMatsui, Guth, et al., 1998Reiners and Grosch, 1998Zehentbauer and Grosch, 1998Lizárraga-Guerra, Guth, et al., 1997Schermann and Schieberle, 1997
Comment MSDC-RI MSDC-RI MSDC-RI MSDC-RI MSDC-RI
Column type CapillaryCapillaryCapillaryCapillaryCapillary
Active phase SE-54SE-54DB-5DB-5SE-54
Column length (m) 30.30.30.30.
Carrier gas HeHe He
Substrate
Column diameter (mm) 0.320.320.320.32
Phase thickness (μm) 0.250.25
Program 35C (2min) => 40C/min => 60C (2min) => 6C/min => 180C => 10C/min => 240C35C (2min) => 40C/min => 60C (2min) => 6C/min => 180C => 10C/min => 240Cnot specified35C => 40C/min => 50C(2min) => 4C/min => 240Cnot specified
I 1215.1215.1213.1211.1216.
ReferenceSchermann and Schieberle, 1997Schermann and Schieberle, 1997Schieberle, 1996Schieberle and Grosch, 1994Guth and Grosch, 1993
Comment MSDC-RI MSDC-RI MSDC-RI MSDC-RI MSDC-RI
Column type CapillaryCapillary
Active phase SE-54DB-1
Column length (m) 30.60.
Carrier gas He
Substrate
Column diameter (mm) 0.320.32
Phase thickness (μm)
Program 40 0C -> (unknowm rate) 50 0C (2 min) 6 0C/min -> 200 0Cnot specified
I 1216.1184.
ReferenceMilo and Grosch, 1993Binder, Flath, et al., 1989
Comment MSDC-RI MSDC-RI

Normal alkane RI, polar column, custom temperature program

Data compiled by: NIST Mass Spectrometry Data Center, William E. Wallace, director

Column type CapillaryCapillaryCapillaryCapillaryCapillary
Active phase DB-FFAPDB-FFAPInnowax FSCHP Innowax FSPDB-Wax Etr
Column length (m) 30.30.60.60.30.
Carrier gas   HeN2H2
Substrate
Column diameter (mm) 0.320.320.250.250.32
Phase thickness (μm) 0.250.250.250.251.
Program 40C(2min) => 40C/min => 60C(2min) => 6C/min => 180C => 15C/min => 230C(10min)35C(2min) => 40C/min => 50C(2min) => 6C/min => 180C => 10C/min => 230C(10min)60C(10min) => 4C/min => 220C (10min) => 1C/min => 240C60C(10min) => 4C/min => 220C(10min) => 1C/min => 240C35C => 10C/min => 110C => 5C/min => 180C => 10C/min => 220C(15min)
I 1698.1718.1715.1715.1740.
ReferenceBuettner, 2007Lasekan, Buettner, et al., 2007Baser K.H.C., Ozek G., et al., 2006Altintas, Kose, et al., 2004Landy, Nicklaus, et al., 2004
Comment MSDC-RI MSDC-RI MSDC-RI MSDC-RI MSDC-RI
Column type CapillaryCapillaryCapillaryCapillaryCapillary
Active phase DB-Wax EtrCarbowax 20MFFAPHP Innowax FSPDB-FFAP
Column length (m) 30. 30.60.30.
Carrier gas H2  HeH2
Substrate
Column diameter (mm) 0.32 0.320.250.3
Phase thickness (μm) 1. 0.250.250.25
Program 35C => 10C/min => 110C => 5C/min => 180C => 10C/min => 220C(15min)not specified35C (2min) => 40C/min => 60C (2min) => 6C/min => 180C => 10C/min => 230C (10min60C(10min) => 4C/min => 220C (10min) => 1C/min => 240C35C (1min) => 40C/min => 60C (5min) => 4C/min => 220C
I 1736.1715.1683.1715.1680.
ReferenceLandy, Nicklaus, et al., 2004Vinogradov, 2004Buettner, Mestres, et al., 2003Tasdemir, Demirci, et al., 2003Triqui and Bouchriti, 2003
Comment MSDC-RI MSDC-RI MSDC-RI MSDC-RI MSDC-RI
Column type CapillaryCapillaryCapillaryCapillaryCapillary
Active phase FFAPHP-Innowax FSCFFAPFFAPFFAP
Column length (m) 30.60.30.25.25.
Carrier gas HeHeHe He
Substrate
Column diameter (mm) 0.320.250.320.320.32
Phase thickness (μm) 0.250.250.250.30.25
Program 35C (2min) => 40C/min => 60C (2min) => 6C/min => 180C => 10C/min => 230C (10min)60C(10min) => 4C/min => 220C(10min) => 1C/min => 240C35C(1min) => 40C/min => 60C (1min) => 6C/min => 230C35C (2min) => 40C/min => 60C(1min) => 6C/min => 230C35C(2min) => 40C/min => 60C(2min) => 6C/min => 230C
I 1696.1715.1670.1708.1681.
ReferenceBuettner and Schieberle, 2001Kivcak B., Mert T., et al., 2001Matsui, Guth, et al., 1998Reiners and Grosch, 1998Zehentbauer and Grosch, 1998
Comment MSDC-RI MSDC-RI MSDC-RI MSDC-RI MSDC-RI
Column type CapillaryCapillaryCapillaryCapillaryCapillary
Active phase DB-FFAPFFAPFFAPSupelcowax-10FFAP
Column length (m) 30.30.30.30.
Carrier gas HeHeHeHe
Substrate
Column diameter (mm) 0.320.320.320.32
Phase thickness (μm)  0.250.25
Program 35C => 40C/min => 60C (1min) => 6C/min => 250C35C (2min) => 40C/min => 60C (2min) => 6C/min => 180C => 10C/min => 240C35C (2min) => 40C/min => 60C (2min) => 6C/min => 180C => 10C/min => 240C35C => 40C/min => 60C(2min) => 4C/min => 240Cnot specified
I 1696.1703.1703.1699.1686.
ReferenceLizárraga-Guerra, Guth, et al., 1997Schermann and Schieberle, 1997Schermann and Schieberle, 1997Schieberle and Grosch, 1994Guth and Grosch, 1993
Comment MSDC-RI MSDC-RI MSDC-RI MSDC-RI MSDC-RI
Column type CapillaryCapillary
Active phase DB-WaxDB-Wax
Column length (m) 30.60.
Carrier gas He
Substrate
Column diameter (mm) 0.250.32
Phase thickness (μm) 0.5
Program 35C => 40C/min => 50C(2min) => 6C/min => 200Cnot specified
I 1708.1697.
ReferenceMilo and Grosch, 1993Binder, Flath, et al., 1989
Comment MSDC-RI MSDC-RI

Normal alkane RI, polar column, temperature ramp

Data compiled by: NIST Mass Spectrometry Data Center, William E. Wallace, director

Column type CapillaryCapillaryCapillaryCapillaryCapillary
Active phase DB-WaxDB-WaxSupelcowax-10Supelcowax-10Supelcowax-10
Column length (m) 30.60.60.60.60.
Carrier gas HeliumHeHeHeHe
Substrate
Column diameter (mm) 0.250.250.530.530.53
Phase thickness (μm) 0.250.251.1.1.
Tstart (C) 60.40.40.40.40.
Tend (C) 200.210.240.240.240.
Heat rate (K/min) 8.3.4.4.4.
Initial hold (min) 3. 2.2.2.
Final hold (min) 9.5 20.20.20.
I 1745.1712.1741.1744.1747.
ReferenceRochat, Egger, et al., 2009Kumazawa, Wada, et al., 2006Rochat and Chaintreau, 2005Rochat and Chaintreau, 2005Rochat and Chaintreau, 2005
Comment MSDC-RI MSDC-RI MSDC-RI MSDC-RI MSDC-RI
Column type CapillaryCapillaryCapillaryCapillaryCapillary
Active phase DB-FFAPDB-FFAPBP-20DB-WaxDB-Wax
Column length (m) 30.30.50.30.60.
Carrier gas HeHeH2HeHe
Substrate
Column diameter (mm) 0.320.320.250.250.25
Phase thickness (μm) 0.250.250.250.250.25
Tstart (C) 40.40.45.40.40.
Tend (C) 230.230.230.210.210.
Heat rate (K/min) 6.6.3.5.5.
Initial hold (min) 2.2.1.
Final hold (min) 10.10.10.
I 1682.1682.1705.1703.1705.
ReferenceCzerny and Schieberle, 2002Czerny and Schieberle, 2002Darriet, Pons, et al., 2002Kumazawa and Masuda, 2002Kumazawa and Masuda, 2002
Comment MSDC-RI MSDC-RI MSDC-RI MSDC-RI MSDC-RI
Column type CapillaryCapillaryCapillaryCapillaryCapillary
Active phase DB-WaxEC-1000DB-WaxHP-FFAPDB-Wax
Column length (m) 30.30.30.50.60.
Carrier gas HeHeHe He
Substrate
Column diameter (mm) 0.320.250.530.320.32
Phase thickness (μm) 0.50.251.0.50.25
Tstart (C) 40.35.40.35.34.
Tend (C) 240.230.225.230.200.
Heat rate (K/min) 7.5.6.6.5.
Initial hold (min)  5.5. 3.
Final hold (min) 5.15.30.15.10.
I 1716.1705.1702.1701.1687.
ReferenceLin, Rouseff, et al., 2002Bendall, 2001Cadwallader and Heo, 2001Preininger and Ullrich, 2001Schlüter, Steinhart, et al., 1999
Comment MSDC-RI MSDC-RI MSDC-RI MSDC-RI MSDC-RI
Column type CapillaryCapillaryCapillaryCapillaryCapillary
Active phase DB-WaxHP-InnowaxTC-WaxSupelcowax-10DB-Wax
Column length (m) 60.25.60.60.60.
Carrier gas    HeHe
Substrate
Column diameter (mm) 0.250.320.250.250.25
Phase thickness (μm)    0.25
Tstart (C) 30.35.80.40.60.
Tend (C) 170.250.240.200.180.
Heat rate (K/min) 2.4.3.3.2.
Initial hold (min) 4. 5.3.4.
Final hold (min) 30.  30.
I 1698.1680.1708.1738.1691.
ReferenceButtery and Ling, 1998Ong, Acree, et al., 1998Shuichi, Masazumi, et al., 1996Wong and Lai, 1996Kobayashi, Tsuda, et al., 1995
Comment MSDC-RI MSDC-RI MSDC-RI MSDC-RI MSDC-RI
Column type CapillaryCapillaryCapillaryCapillaryCapillary
Active phase DB-WaxDB-WaxDB-WaxDB-WaxCarbowax 20M
Column length (m) 60.60.60.60.150.
Carrier gas He
Substrate
Column diameter (mm) 0.250.250.320.320.64
Phase thickness (μm)
Tstart (C) 60.60.50.50.50.
Tend (C) 180.220.230.230.170.
Heat rate (K/min) 2.3.4.4.1.
Initial hold (min) 4.4. 0.130.
Final hold (min)   10.10.
I 1693.1738.1697.1693.1660.
ReferenceKobayashi, Tsuda, et al., 1995Chung, Eiserich, et al., 1993Binder, Turner, et al., 1990Binder, Flath, et al., 1989Buttery, Ling, et al., 1980
Comment MSDC-RI MSDC-RI MSDC-RI MSDC-RI MSDC-RI

Van Den Dool and Kratz RI, polar column, temperature ramp

Data compiled by: NIST Mass Spectrometry Data Center, William E. Wallace, director

Column type CapillaryCapillaryCapillaryCapillaryCapillary
Active phase FFAPFFAPDB-FFAPDB-FFAPDB-Wax
Column length (m) 30.30.30.30.30.
Carrier gas HeHeHeN2He
Substrate
Column diameter (mm) 0.250.250.320.250.32
Phase thickness (μm) 0.250.250.240.250.5
Tstart (C) 35.35.40.30.40.
Tend (C) 225.225.240.250.240.
Heat rate (K/min) 10.10.6.3.7.
Initial hold (min) 5.5.2.2.
Final hold (min) 25.25.10.2.5.
I 1698.1691.1696.1688.1702.
ReferenceLozano P.R., Drake M., et al., 2007Lozano P.R., Drake M., et al., 2007Scheidig, Czerny, et al., 2007Colahan-Sederstrom and Peterson, 2005Mahattanatawee, Rouseff, et al., 2005
Comment MSDC-RI MSDC-RI MSDC-RI MSDC-RI MSDC-RI
Column type CapillaryCapillaryCapillaryCapillaryCapillary
Active phase DB-WaxDB-WaxDB-WaxDB-WaxDB-Wax
Column length (m) 30.30.30.30.30.
Carrier gas HeHe He
Substrate
Column diameter (mm) 0.250.250.320.250.32
Phase thickness (μm) 0.50.250.50.250.5
Tstart (C) 40.45.40.40.40.
Tend (C) 230.240.240.240.240.
Heat rate (K/min) 5.6.7.6.7.
Initial hold (min) 2.10. 10.
Final hold (min) 10.30.5.30.5.
I 1681.1686.1705.1686.1709.
ReferenceMahajan, Goddik, et al., 2004Nielsen, Larsen, et al., 2004Högnadóttir and Rouseff, 2003Nielsen, Larsen, et al., 2003Valim, Rouseff, et al., 2003
Comment MSDC-RI MSDC-RI MSDC-RI MSDC-RI MSDC-RI
Column type CapillaryCapillaryCapillaryCapillaryCapillary
Active phase ZB-WaxZB-WaxDB-WaxDB-FFAPDB-Wax
Column length (m) 60.60.30.30.30.
Carrier gas HeHe
Substrate
Column diameter (mm) 0.320.320.250.250.25
Phase thickness (μm) 0.250.250.250.250.25
Tstart (C) 40.40.35.35.35.
Tend (C) 220.220.200.200.200.
Heat rate (K/min) 3.3.10.10.10.
Initial hold (min)   5.5.5.
Final hold (min)   30.30.30.
I 1664.1664.1681.1683.1701.
ReferenceBrunton, Cronin, et al., 2002Brunton, Cronin, et al., 2002Karagül-Yüceer, Cadwallader, et al., 2002Karagül-Yüceer, Cadwallader, et al., 2002Karagül-Yüceer, Drake, et al., 2001
Comment MSDC-RI MSDC-RI MSDC-RI MSDC-RI MSDC-RI
Column type CapillaryCapillary
Active phase PEG-20MDB-Wax
Column length (m) 60.60.
Carrier gas HeHe
Substrate
Column diameter (mm) 0.250.25
Phase thickness (μm) 0.250.25
Tstart (C) 50.50.
Tend (C) 230.230.
Heat rate (K/min) 2.2.
Initial hold (min)
Final hold (min) 60.60.
I 1706.1706.
ReferenceShimoda, Nakada, et al., 1997Shimoda, Shiratsuchi, et al., 1996
Comment MSDC-RI MSDC-RI

References

Al-Qudah, Muhaidat, et al., 2012
Al-Qudah, M.A.; Muhaidat, R.; Trawenh, I.N.; Jaber, H.I.; Abu Zarga, M.H.; Abu Orabi, S.T., Volatile constituents of leaves and bulbs of Gynandriris Sisyrinchicum and their antimicrobial activities, Jordan J. Chem., 2012, 7, 3, 287-295. [all data]

Chen, Song, et al., 2009
Chen, G.; Song, H.; Ma, C., Aroma-active aompounds of Beijing roast duck, Flavour Fragr. J., 2009, 24, 4, 186-191, https://doi.org/10.1002/ffj.1932 . [all data]

Zhao, Zeng, et al., 2009
Zhao, C.; Zeng, Y.; Wan, M.; Li, R.; Liang, Y.; Li, C.; Zeng, Z.; Chau, F.-T., Comparative analysis of essential oils from eight herbal medicines with pungent flavor and cool nature by GC-MS and chemometric resolution methods, J. Sep. Sci., 2009, 32, 4, 660-670, https://doi.org/10.1002/jssc.200800484 . [all data]

Boustie, Rapior, et al., 2005
Boustie, J.; Rapior, S.; Fortin, H.; Tomas, S.; Bessiere, J.-M., Chemotaxonomic interest of volatile components in Lepista inversa and Lepista flaccida distinctions, Cryptogamie, Mycologie, 2005, 26, 1, 1-4. [all data]

van Loon, Linssen, et al., 2005
van Loon, W.A.M.; Linssen, J.P.H.; Legger, A.; Posthumus, M.A.; Voragen, A.G.J., Identification and olfactometry of French fries flavour extracted at mouth conditions, Food Chem., 2005, 90, 3, 417-425, https://doi.org/10.1016/j.foodchem.2004.05.005 . [all data]

Utsunomia, Kawata, et al., 2005
Utsunomia, H.; Kawata, J.; Chanoki, W.; Shirakawa, N.; Miyazawa, M., Components of Essential Oil from Woods of Prunus mume Sieb. at Zucc., J. Oleo Sci., 2005, 54, 11, 609-612, https://doi.org/10.5650/jos.54.609 . [all data]

Kilic, Hafizoglu, et al., 2004
Kilic, A.; Hafizoglu, H.; Kollmannsberger, H.; Nitz, S., Volatile constituents and key odorants in leaves, buds, flowers, and fruits of Laurus nobilis L., J. Agric. Food Chem., 2004, 52, 6, 1601-1606, https://doi.org/10.1021/jf0306237 . [all data]

Landy, Nicklaus, et al., 2004
Landy, P.; Nicklaus, S.; Sémon, E.; Mielle, P.; Guichard, E., Representativeness of extracts of offset paper packaging and analysis of the main odor-active compounds, J. Agric. Food Chem., 2004, 52, 8, 2326-2334, https://doi.org/10.1021/jf0352677 . [all data]

Raal, Arak, et al., 2004
Raal, A.; Arak, E.; Orav, A., Chemical composition of coriander seed essential oil and their conformity with EP standards, Agraarteadus, 2004, 15, 4, 234-239. [all data]

Dhanda, Pegg, et al., 2003
Dhanda, J.S.; Pegg, R.B.; Shand, P.J., Saskatchewan specialty livestock value-added program - Saskatchewan agri-food innovation fund (AFIF) Project #98000016, 2003, retrieved from http://www.agr.gov.sk.ca/afif/Projects/19980016.pdf. [all data]

Triqui and Bouchriti, 2003
Triqui, R.; Bouchriti, N., Freshness assessments of Moroccan sardine (Sardina pilchardus): comparison of overall sensory changes to instrumentally determined volatiles, J. Agric. Food Chem., 2003, 51, 26, 7540-7546, https://doi.org/10.1021/jf0348166 . [all data]

Czerny and Schieberle, 2002
Czerny, M.; Schieberle, P., Important aroma compounds in freshly ground wholemeal and white wheat flour-identification and quantitative changes during sourdough fermentation, J. Agric. Food Chem., 2002, 50, 23, 6835-6840, https://doi.org/10.1021/jf020638p . [all data]

Darriet, Pons, et al., 2002
Darriet, P.; Pons, M.; Henry, R.; Dumont, O.; Findeling, V.; Cartolaro, P.; Calonnec, A.; Dubourdieu, D., Impact odorants contributing to the fungus type aroma from grape berries contaminated by powdery mildew (Uncinula necator); incidence of enzymatic activities of the yeast Saccharomyces cerevisiae, J. Agric. Food Chem., 2002, 50, 11, 3277-3282, https://doi.org/10.1021/jf011527d . [all data]

Lin, Rouseff, et al., 2002
Lin, J.; Rouseff, R.L.; Barros, S.; Naim, M., Aroma composition changes in early season grapefruit juice produced from thermal concentration, J. Agric. Food Chem., 2002, 50, 4, 813-819, https://doi.org/10.1021/jf011154g . [all data]

Sies A., Hirsch R., et al., 2002
Sies A.; Hirsch R.; Löscher R.; Tablack P.; Guth H., Direct thermal desorption and Fast-GC-TOF-MS for a rapid quality control of hazelnuts, 10th Weurman Flavour Research Symposium, 24 - 28 June 2002, Beaune, France, 2002. [all data]

Cadwallader and Heo, 2001
Cadwallader, K.R.; Heo, J., Aroma of roasted sesame oil: characterization by direct thermal desorption-gas chromatography-olfactometry and sample dilution analysis, Am. Chem. Soc. Symp. Ser., 2001, 782, 187-202. [all data]

de Beck, Bessière, et al., 2000
de Beck, P.O.; Bessière, J.M.; Dijoux-Franca, M.-G.; David, B.; Mariotte, A.-M., Volatile constituents from leaves and wood of Leea guineensis G. Don (Leeaceae) from Cameroon, Flavour Fragr. J., 2000, 15, 3, 182-185, https://doi.org/10.1002/1099-1026(200005/06)15:3<182::AID-FFJ888>3.0.CO;2-X . [all data]

Schlüter, Steinhart, et al., 1999
Schlüter, S.; Steinhart, H.; Schwarz, F.J.; Kirchgessner, M., Changes in the odorants of boiled carp fillet (Cyprinus carpio L.) as affected by increasing methionine levels in feed, J. Agric. Food Chem., 1999, 47, 12, 5146-5150, https://doi.org/10.1021/jf9902604 . [all data]

Ong, Acree, et al., 1998
Ong, P.K.C.; Acree, T.E.; Lavin, E.H., Characterization of volatiles in rambutan fruit (Nephelium lappaceum L.), J. Agric. Food Chem., 1998, 46, 2, 611-615, https://doi.org/10.1021/jf970665t . [all data]

Milo and Grosch, 1996
Milo, C.; Grosch, W., Changes in the odorants of boiled salmon and cod as affected by the storage of the raw material, J. Agric. Food Chem., 1996, 44, 8, 2366-2371, https://doi.org/10.1021/jf9507203 . [all data]

Tamura, Nakamoto, et al., 1995
Tamura, H.; Nakamoto, H.; Yang, R.-H.; Sugisawa, H., Characteristic aroma compounds in green algae (Ulva pertusa) volatiles, Nippon Shokuhin Kagaku Kogaku Kaishi, 1995, 42, 11, 887-891, https://doi.org/10.3136/nskkk.42.887 . [all data]

Schieberle, 1991
Schieberle, P., Primary odorants in popcorn, J. Agric. Food Chem., 1991, 39, 6, 1141-1144, https://doi.org/10.1021/jf00006a030 . [all data]

Binder, Turner, et al., 1990
Binder, R.G.; Turner, C.E.; Flath, R.A., Comparison of yellow starthistle volatiles from different plant parts, J. Agric. Food Chem., 1990, 38, 3, 764-767, https://doi.org/10.1021/jf00093a038 . [all data]

Sugisawa, Nakamura, et al., 1990
Sugisawa, H.; Nakamura, K.; Tamura, H., The aroma profile of the volatile in marine green algae (Ulva pertusa), Food Reviews International, 1990, 6, 4, 573-589, https://doi.org/10.1080/87559129009540893 . [all data]

Binder, Flath, et al., 1989
Binder, R.G.; Flath, R.A.; Mon, T.R., Volatile components of bittermelon, J. Agric. Food Chem., 1989, 37, 2, 418-420, https://doi.org/10.1021/jf00086a032 . [all data]

Wu, Liou, et al., 1987
Wu, C.-M.; Liou, S.-E.; Chang, Y.-H.; Chiang, W., Volatile compounds of the wax gourd (Benincasa hispida, Cogn) and a wax gourd beverage, J. Food Sci., 1987, 52, 1, 132-134, https://doi.org/10.1111/j.1365-2621.1987.tb13988.x . [all data]

Heydanek and McGorrin, 1981
Heydanek, M.G.; McGorrin, R.J., Gas chromatography-mass spectroscopy identification of volatiles from rancid oat groats, J. Agric. Food Chem., 1981, 29, 5, 1093-1095, https://doi.org/10.1021/jf00107a051 . [all data]