Cadmium, dipropyl-

Phase change data

Data compiled as indicated in comments:
MS - José A. Martinho Simões
AC - William E. Acree, Jr., James S. Chickos

Quantity Value Units Method Reference Comment
Δvap54.2 ± 0.4kJ/molN/ASokolovskii and Baev, 1985MS

Enthalpy of vaporization

ΔvapH (kJ/mol) Temperature (K) Reference Comment
54.2 ± 0.4342.Sokolovski and Baev, 1985Based on data from 312. - 373. K. See also Baev, 2001.; AC

References

Sokolovskii and Baev, 1985
Sokolovskii, A.E.; Baev, A.K., Vestsi Akad. Navuk BSSR, Ser. Khim. Navuk, 1985, 112.. [all data]

Sokolovski and Baev, 1985
Sokolovski, A.E.; Baev, A.K., Vestsi Akad. G. Emii Navuk BSSR Ser. Khim. Navuk, 1985, 1112. [all data]

Baev, 2001
Baev, A.K., Izv. Vyssh. Uchebn. Zaved., Khim. Khim. Tekhnol., 2001, 44, 1, 3. [all data]