Propane, 2-isothiocyanato-2-methyl-

Gas phase ion energetics data

Data compiled by: Sharon G. Lias and Joel F. Liebman

Ionization energy determinations

IE (eV) Method Reference Comment
9.06PEVeszpremi, Pasinszki, et al., 1991Vertical value

References

Veszpremi, Pasinszki, et al., 1991
Veszpremi, T.; Pasinszki, T.; Feher, M., Photoelectron spectroscopic studies of the silicon pseudohalides: Relationship between geometrical and electronic structure, J. Chem. Soc. Faraday Trans., 1991, 87, 3805. [all data]