Pentane, 2,2-dimethyl-
- Formula: C7H16
- Molecular weight: 100.2019
- IUPAC Standard InChIKey: CXOWYJMDMMMMJO-UHFFFAOYSA-N
- CAS Registry Number: 590-35-2
- Chemical structure:

Gas phase thermochemistry data

Data compiled as indicated in comments:
ALS - Hussein Y. Afeefy, Joel F. Liebman, and Stephen E. Stein
DRB - Donald R. Burgess, Jr.
GT - Glushko Thermocenter, Russian Academy of Sciences, Moscow
Quantity | Value | Units | Method | Reference | Comment |
---|---|---|---|---|---|
ΔfH°gas | -206.2 ± 1.3 | kJ/mol | Ccb | Prosen and Rossini, 1945 | ALS |
ΔfH°gas | -209.5 | kJ/mol | N/A | Davies and Gilbert, 1941 | Value computed using ΔfHliquid° value of -242.0±1.0 kj/mol from Davies and Gilbert, 1941 and ΔvapH° value of 32.5 kj/mol from Prosen and Rossini, 1945.; DRB |
Quantity | Value | Units | Method | Reference | Comment |
S°gas | 392.88 | J/mol*K | N/A | Huffman H.M., 1961 | GT |
Constant pressure heat capacity of gas
Cp,gas (J/mol*K) | Temperature (K) | Reference | Comment |
---|---|---|---|
116.86 | 200. | Scott D.W., 1974 | Recommended values were obtained from the consistent correlation scheme for alkanes [ Scott D.W., 1974, 2, Scott D.W., 1974]. This approach gives a good agreement with experimental data available for alkanes. However, large uncertainties could be expected at high temperatures.; GT |
153.93 | 273.15 | ||
166.7 ± 0.4 | 298.15 | ||
167.65 | 300. | ||
216.77 | 400. | ||
259.78 | 500. | ||
296.65 | 600. | ||
328.03 | 700. | ||
355.22 | 800. | ||
379.07 | 900. | ||
399.99 | 1000. | ||
418.40 | 1100. | ||
434.72 | 1200. | ||
447.69 | 1300. | ||
464.42 | 1400. | ||
476.98 | 1500. |

Condensed phase thermochemistry data

Data compiled as indicated in comments:
ALS - Hussein Y. Afeefy, Joel F. Liebman, and Stephen E. Stein
DH - Eugene S. Domalski and Elizabeth D. Hearing
Quantity | Value | Units | Method | Reference | Comment |
---|---|---|---|---|---|
ΔfH°liquid | -238.7 ± 1.3 | kJ/mol | Ccb | Prosen and Rossini, 1945 | ALS |
ΔfH°liquid | -242. ± 1. | kJ/mol | Ccb | Davies and Gilbert, 1941 | ALS |
Quantity | Value | Units | Method | Reference | Comment |
ΔcH°liquid | -4802.6 ± 1.3 | kJ/mol | Ccb | Prosen and Rossini, 1945 | Corresponding ΔfHºliquid = -238.6 kJ/mol (simple calculation by NIST; no Washburn corrections); ALS |
ΔcH°liquid | -4798. ± 1. | kJ/mol | Ccb | Davies and Gilbert, 1941 | Corresponding ΔfHºliquid = -242.8 kJ/mol (simple calculation by NIST; no Washburn corrections); ALS |
Quantity | Value | Units | Method | Reference | Comment |
S°liquid | 300.29 | J/mol*K | N/A | Huffman, Gross, et al., 1961 | DH |
S°liquid | 284.9 | J/mol*K | N/A | Huffman, Parks, et al., 1930 | Extrapolation below 90 K, 64.10 J/mol*K.; DH |
Constant pressure heat capacity of liquid
Cp,liquid (J/mol*K) | Temperature (K) | Reference | Comment |
---|---|---|---|
221.12 | 298.15 | Huffman, Gross, et al., 1961 | T = 10 to 300 K.; DH |
217.1 | 294.1 | Huffman, Parks, et al., 1930 | T = 92 to 294 K. Value is unsmoothed experimental datum.; DH |

Phase change data

Data compiled as indicated in comments:
BS - Robert L. Brown and Stephen E. Stein
TRC - Thermodynamics Research Center, NIST Boulder Laboratories, Chris Muzny director
AC - William E. Acree, Jr., James S. Chickos
ALS - Hussein Y. Afeefy, Joel F. Liebman, and Stephen E. Stein
DH - Eugene S. Domalski and Elizabeth D. Hearing
Quantity | Value | Units | Method | Reference | Comment |
---|---|---|---|---|---|
Tboil | 352.3 ± 0.3 | K | AVG | N/A | Average of 48 out of 53 values; Individual data points |
Quantity | Value | Units | Method | Reference | Comment |
Tfus | 149. ± 2. | K | AVG | N/A | Average of 20 out of 22 values; Individual data points |
Quantity | Value | Units | Method | Reference | Comment |
Ttriple | 149.2 ± 0.9 | K | AVG | N/A | Average of 7 values; Individual data points |
Quantity | Value | Units | Method | Reference | Comment |
Tc | 520.5 ± 0.5 | K | N/A | Daubert, 1996 | |
Tc | 520.44 | K | N/A | McMicking and Kay, 1965 | Uncertainty assigned by TRC = 0.4 K; TRC |
Tc | 520.85 | K | N/A | Edgar and Calingaert, 1929 | Uncertainty assigned by TRC = 0.5 K; measured by Keys and Kleinschmidt; TRC |
Quantity | Value | Units | Method | Reference | Comment |
Pc | 27.7 ± 0.5 | bar | N/A | Daubert, 1996 | |
Pc | 27.730 | bar | N/A | McMicking and Kay, 1965 | Uncertainty assigned by TRC = 0.4053 bar; TRC |
Pc | 28.7763 | bar | N/A | Edgar and Calingaert, 1929 | Uncertainty assigned by TRC = 0.5066 bar; measured by Keys and Kleinschmidt; TRC |
Quantity | Value | Units | Method | Reference | Comment |
Vc | 0.416 | l/mol | N/A | Daubert, 1996 | |
Quantity | Value | Units | Method | Reference | Comment |
ρc | 2.41 ± 0.05 | mol/l | N/A | Daubert, 1996 | |
ρc | 2.41 | mol/l | N/A | McMicking and Kay, 1965 | Uncertainty assigned by TRC = 0.05 mol/l; TRC |
Quantity | Value | Units | Method | Reference | Comment |
ΔvapH° | 32.56 | kJ/mol | N/A | Majer and Svoboda, 1985 | |
ΔvapH° | 32.4 ± 0.1 | kJ/mol | C | Svoboda, 1998 | AC |
ΔvapH° | 32.4 ± 0.1 | kJ/mol | C | Osborne and Ginnings, 1947 | AC |
ΔvapH° | 32.2 ± 0.1 | kJ/mol | C | Osborne and Ginnings, 1947 | AC |
ΔvapH° | 32.42 | kJ/mol | C | Osborne and Ginnings, 1947, 2 | ALS |
Reduced pressure boiling point
Tboil (K) | Pressure (bar) | Reference | Comment |
---|---|---|---|
351.2 | 0.991 | Aldrich Chemical Company Inc., 1990 | BS |
Enthalpy of vaporization
ΔvapH (kJ/mol) | Temperature (K) | Method | Reference | Comment |
---|---|---|---|---|
29.23 | 352.4 | N/A | Majer and Svoboda, 1985 | |
31.8 ± 0.1 | 308. | C | Svoboda, 1998 | AC |
31.4 ± 0.1 | 315. | C | Svoboda, 1998 | AC |
31.0 ± 0.1 | 323. | C | Svoboda, 1998 | AC |
30.5 ± 0.1 | 330. | C | Svoboda, 1998 | AC |
30.1 ± 0.1 | 338. | C | Svoboda, 1998 | AC |
29.4 ± 0.1 | 348. | C | Svoboda, 1998 | AC |
28.8 ± 0.1 | 358. | C | Svoboda, 1998 | AC |
28.1 ± 0.1 | 368. | C | Svoboda, 1998 | AC |
33.2 | 292. | A | Stephenson and Malanowski, 1987 | Based on data from 277. to 354. K.; AC |
30.1 | 368. | A | Stephenson and Malanowski, 1987 | Based on data from 353. to 483. K.; AC |
32.8 | 300. | N/A | Forziati, Norris, et al., 1949 | Based on data from 285. to 353. K.; AC |
32.6 | 303. | MM | Willingham, Taylor, et al., 1945 | Based on data from 288. to 353. K.; AC |
Antoine Equation Parameters
log10(P) = A − (B / (T + C))
P = vapor pressure (bar)
T = temperature (K)
View plot Requires a JavaScript / HTML 5 canvas capable browser.
Temperature (K) | A | B | C | Reference |
---|---|---|---|---|
288.47 to 353.20 | 3.93999 | 1190.298 | -49.807 | Williamham, Taylor, et al., 1945 |
Enthalpy of fusion
ΔfusH (kJ/mol) | Temperature (K) | Reference | Comment |
---|---|---|---|
5.824 | 149.43 | Huffman, Gross, et al., 1961 | DH |
5.86 | 148.1 | Acree, 1991 | AC |
5.862 | 148.1 | Huffman, Parks, et al., 1930 | DH |
Entropy of fusion
ΔfusS (J/mol*K) | Temperature (K) | Reference | Comment |
---|---|---|---|
38.98 | 149.43 | Huffman, Gross, et al., 1961 | DH |
39.58 | 148.1 | Huffman, Parks, et al., 1930 | DH |

Reaction thermochemistry data

Data compiled by: Hussein Y. Afeefy, Joel F. Liebman, and Stephen E. Stein
Individual Reactions
By formula: H2 + C7H14 = C7H16
Quantity | Value | Units | Method | Reference | Comment |
---|---|---|---|---|---|
ΔrH° | -122.6 ± 0.6 | kJ/mol | Chyd | Rogers and Dejroongruang, 1989 | liquid phase; solvent: Cyclohexane |
ΔrH° | -122.5 ± 0.42 | kJ/mol | Chyd | Dolliver, Gresham, et al., 1937 | gas phase; Reanalyzed by Cox and Pilcher, 1970, Original value = -123.56 ± 0.63 kJ/mol; At 355 °K |
By formula: H2 + C7H14 = C7H16
Quantity | Value | Units | Method | Reference | Comment |
---|---|---|---|---|---|
ΔrH° | -114.2 ± 0.4 | kJ/mol | Chyd | Rogers and Dejroongruang, 1989 | liquid phase; solvent: Cyclohexane |
ΔrH° | -111. | kJ/mol | Chyd | Turner, Nettleton, et al., 1958 | liquid phase; solvent: Acetic acid |
By formula: H2 + C7H14 = C7H16
Quantity | Value | Units | Method | Reference | Comment |
---|---|---|---|---|---|
ΔrH° | -130.4 ± 0.4 | kJ/mol | Chyd | Rogers and Dejroongruang, 1989 | liquid phase; solvent: Cyclohexane |
ΔrH° | -129. | kJ/mol | Chyd | Turner, Nettleton, et al., 1958 | liquid phase; solvent: Acetic acid |
By formula: C7H16 = C7H16
Quantity | Value | Units | Method | Reference | Comment |
---|---|---|---|---|---|
ΔrH° | -14.3 ± 1.2 | kJ/mol | Ccb | Prosen and Rossini, 1941 | liquid phase; Heat of Isomerization |
ΔrH° | -18.6 ± 1.3 | kJ/mol | Ccb | Prosen and Rossini, 1941 | gas phase; Heat of Isomerization |

Henry's Law data

Data compiled by: Rolf Sander
Henry's Law constant (water solution)
kH(T) = k°H exp(d(ln(kH))/d(1/T) ((1/T) - 1/(298.15 K)))
k°H = Henry's law constant for solubility in water at 298.15 K (mol/(kg*bar))
d(ln(kH))/d(1/T) = Temperature dependence constant (K)
k°H (mol/(kg*bar)) | d(ln(kH))/d(1/T) (K) | Method | Reference | Comment |
---|---|---|---|---|
0.00031 | Q | N/A | missing citation give several references for the Henry's law constants but don't assign them to specific species. | |
0.00032 | L | N/A |

Kovats' RI, non-polar column, isothermal

Column type | Active phase | Temperature (C) | I | Reference | Comment |
---|---|---|---|---|---|
Capillary | OV-101 | 40. | 622.4 | Chen, Liang, et al., 2001 | He; Column length: 50. m; Column diameter: 0.25 mm |
Capillary | OV-101 | 60. | 624.1 | Chen, Liang, et al., 2001 | He; Column length: 50. m; Column diameter: 0.25 mm |
Packed | C78, Branched paraffin | 130. | 627.7 | Dallos, Sisak, et al., 2000 | He; Column length: 3.3 m |
Capillary | Squalane | 100. | 626. | Heinzen, Soares, et al., 1999 | |
Capillary | OV-101 | 0. | 621. | Skrbic, 1997 | |
Packed | Squalane | 78.5 | 628.0 | Zhang and Lu, 1996 | |
Capillary | CP Sil 2 | 60. | 621.8 | Estel, Mohnke, et al., 1995 | 100. m/0.25 mm/0.25 μm |
Capillary | DB-1 | 60. | 625.7 | Krupcik, Skacani, et al., 1994 | H2; Phase thickness: 0.25 μm |
Capillary | PONA | 60. | 625.6 | Krupcik, Skacani, et al., 1994 | H2; Phase thickness: 0.5 μm |
Capillary | PONA | 60. | 625.7 | Krupcik, Skacani, et al., 1994 | H2; Phase thickness: 0.5 μm |
Capillary | DB-1 | 60. | 625.6 | Krupcik, Skacani, et al., 1994 | H2; Phase thickness: 1. μm |
Capillary | OV-101 | 60. | 625.7 | Krupcik, Skacani, et al., 1994 | H2; Phase thickness: 0.2 μm |
Packed | C78, Branched paraffin | 130. | 627.9 | Reddy, Dutoit, et al., 1992 | Chromosorb G HP; Column length: 3.3 m |
Capillary | HP-1 | 60. | 625. | Zhang, Li, et al., 1992 | N2; Column length: 25. m; Column diameter: 0.20 mm |
Capillary | HP-1 | 60. | 626. | Zhang, Li, et al., 1992 | N2; Column length: 25. m; Column diameter: 0.20 mm |
Packed | Apolane | 130. | 628. | Dutoit, 1991 | Column length: 3.7 m |
Capillary | OV-1 | 45. | 624.8 | Guan, Kiraly, et al., 1989 | 25. m/0.31 mm/0.52 μm, He |
Capillary | OV-1 | 65. | 628.1 | Guan, Kiraly, et al., 1989 | 25. m/0.31 mm/0.52 μm, He |
Capillary | Squalane | 50. | 625.6 | Guan, Kiraly, et al., 1989 | 50. m/0.22 mm/0.21 μm, He |
Capillary | Squalane | 70. | 626.9 | Guan, Kiraly, et al., 1989 | 50. m/0.22 mm/0.21 μm, He |
Capillary | OV-101 | 40. | 626. | Laub and Purnell, 1988 | |
Capillary | OV-101 | 60. | 626. | Laub and Purnell, 1988 | |
Capillary | OV-101 | 80. | 627. | Laub and Purnell, 1988 | |
Capillary | Squalane | 50. | 625.6 | Lunskii and Paizanskaya, 1988 | He; Column length: 50. m; Column diameter: 0.22 mm |
Capillary | Squalane | 70. | 626.9 | Lunskii and Paizanskaya, 1988 | He; Column length: 50. m; Column diameter: 0.22 mm |
Capillary | OV-101 | 40. | 623.8 | Boneva and Dimov, 1986 | 100. m/0.27 mm/0.9 μm |
Capillary | OV-101 | 50. | 624.8 | Boneva and Dimov, 1986 | 100. m/0.27 mm/0.9 μm |
Capillary | OV-101 | 60. | 625.1 | Boneva and Dimov, 1986 | 100. m/0.27 mm/0.9 μm |
Capillary | OV-101 | 70. | 626.0 | Boneva and Dimov, 1986 | 100. m/0.27 mm/0.9 μm |
Capillary | OV-101 | 30. | 625. | Chien, Furio, et al., 1983 | |
Capillary | OV-101 | 40. | 626. | Chien, Furio, et al., 1983 | |
Capillary | OV-101 | 50. | 626. | Chien, Furio, et al., 1983 | |
Capillary | OV-101 | 60. | 626. | Chien, Furio, et al., 1983 | |
Capillary | OV-101 | 70. | 627. | Chien, Furio, et al., 1983 | |
Capillary | OV-101 | 80. | 627. | Chien, Furio, et al., 1983 | |
Capillary | OV-3 | 30. | 622.7 | Chien, Furio, et al., 1983, 2 | |
Capillary | OV-3 | 40. | 623.2 | Chien, Furio, et al., 1983, 2 | |
Capillary | OV-3 | 50. | 623.8 | Chien, Furio, et al., 1983, 2 | |
Capillary | OV-3 | 60. | 624.4 | Chien, Furio, et al., 1983, 2 | |
Capillary | OV-3 | 70. | 625.1 | Chien, Furio, et al., 1983, 2 | |
Capillary | OV-3 | 80. | 625.8 | Chien, Furio, et al., 1983, 2 | |
Capillary | DB-1 | 60. | 625.7 | Lubeck and Sutton, 1983 | Column length: 60. m; Column diameter: 0.264 mm |
Capillary | DB-1 | 60. | 625.6 | Lubeck and Sutton, 1983 | 60. m/0.259 mm/1. μm |
Capillary | OV-1 | 50. | 625. | Anders, Scheller, et al., 1982 | Column length: 55. m; Column diameter: 0.21 mm |
Capillary | OV-101 | 50. | 625. | Johansen and Ettre, 1982 | 100. m/0.27 mm/0.20 μm |
Capillary | OV-101 | 50. | 625. | Johansen and Ettre, 1982 | 55. m/0.27 mm/0.9 μm |
Capillary | OV-1 | 50. | 626. | Johansen and Ettre, 1982 | 17.5 m/0.2 mm/0.15 μm |
Capillary | SE-30 | 50. | 626. | Johansen and Ettre, 1982 | 17.5 m/0.2 mm/0.15 μm |
Capillary | SF-96 | 50. | 624. | Johansen and Ettre, 1982 | 91.4 m/0.31 mm/0.20 μm |
Capillary | OV-1 | 30. | 623.4 | Chien, Kopecni, et al., 1981 | H2 |
Capillary | OV-1 | 40. | 624.6 | Chien, Kopecni, et al., 1981 | H2 |
Capillary | OV-1 | 50. | 625.7 | Chien, Kopecni, et al., 1981 | H2 |
Capillary | OV-1 | 60. | 627. | Chien, Kopecni, et al., 1981 | H2 |
Capillary | OV-1 | 70. | 628.3 | Chien, Kopecni, et al., 1981 | H2 |
Capillary | OV-1 | 80. | 629.7 | Chien, Kopecni, et al., 1981 | H2 |
Capillary | SE-30 | 30. | 627.2 | Chien, Kopecni, et al., 1981 | H2 |
Capillary | SE-30 | 40. | 626.5 | Chien, Kopecni, et al., 1981 | H2 |
Capillary | SE-30 | 50. | 625.6 | Chien, Kopecni, et al., 1981 | H2 |
Capillary | SE-30 | 60. | 625. | Chien, Kopecni, et al., 1981 | H2 |
Capillary | SE-30 | 70. | 624.1 | Chien, Kopecni, et al., 1981 | H2 |
Capillary | SE-30 | 80. | 623.1 | Chien, Kopecni, et al., 1981 | H2 |
Capillary | Squalane | 50. | 625. | Mitra, 1981 | N2; Column length: 100. m; Column diameter: 0.25 mm |
Capillary | Squalane | 50. | 626. | Mitra, 1981 | N2; Column length: 100. m; Column diameter: 0.25 mm |
Capillary | OV-1 | 60. | 624. | Nijs and Jacobs, 1981 | He; Column length: 150. m; Column diameter: 0.50 mm |
Packed | Triacontane | 70. | 625. | Castello and D'Amato, 1979 | He, Chromosorb W AW (60-80 mesh); Column length: 3. m |
Packed | Triacontane | 80. | 626. | Castello and D'Amato, 1979 | He, Chromosorb W AW (60-80 mesh); Column length: 3. m |
Packed | Squalane | 70. | 627. | Castello and D'Amato, 1979 | He, Chromosorb W AW (60-80 mesh); Column length: 3. m |
Packed | Squalane | 80. | 628. | Castello and D'Amato, 1979 | He, Chromosorb W AW (60-80 mesh); Column length: 3. m |
Packed | OV-1 | 80. | 627. | Dimov and Papazova, 1979 | Chromosorb W AW DMCS (80-100 mesh); Column length: 4. m |
Packed | SE-30 | 80. | 626. | Dimov and Papazova, 1979 | Chromosorb W AW DMCS (80-100 mesh); Column length: 4. m |
Capillary | Squalane | 60. | 626. | Chretien and Dubois, 1976 | |
Packed | Apolane | 70. | 624.2 | Riedo, Fritz, et al., 1976 | He, Chromosorb; Column length: 2.4 m |
Capillary | Squalane | 50. | 625. | Rijks, van den Berg, et al., 1974 | |
Capillary | Squalane | 50. | 625. | Rijks, van den Berg, et al., 1974 | |
Capillary | Squalane | 50. | 626. | Rijks, van den Berg, et al., 1974 | |
Capillary | Squalane | 50. | 626. | Rijks, van den Berg, et al., 1974 | |
Capillary | Squalane | 70. | 627. | Rijks, van den Berg, et al., 1974 | |
Capillary | Squalane | 50. | 626. | Rijks and Cramers, 1974 | N2; Column length: 100. m; Column diameter: 0.25 mm |
Capillary | Squalane | 70. | 627. | Rijks and Cramers, 1974 | N2; Column length: 100. m; Column diameter: 0.25 mm |
Packed | SF-96 | 100. | 629.7 | Castello, Berg, et al., 1973 | Chromosorb P(DMCS); Column length: 4. m |
Packed | SF-96 | 110. | 630.4 | Castello, Berg, et al., 1973 | Chromosorb P(DMCS); Column length: 4. m |
Packed | SF-96 | 120. | 631.7 | Castello, Berg, et al., 1973 | Chromosorb P(DMCS); Column length: 4. m |
Packed | SF-96 | 80. | 627.79 | Castello, Berg, et al., 1973 | Chromosorb P(DMCS); Column length: 4. m |
Packed | SF-96 | 90. | 628.51 | Castello, Berg, et al., 1973 | Chromosorb P(DMCS); Column length: 4. m |
Capillary | Vacuum Grease Oil (VM-4) | 35. | 621. | Sidorov, Petrova, et al., 1972 | |
Capillary | Vacuum Grease Oil (VM-4) | 45. | 622. | Sidorov, Petrova, et al., 1972 | |
Capillary | Vacuum Grease Oil (VM-4) | 50. | 623. | Sidorov, Petrova, et al., 1972 | |
Capillary | Vacuum Grease Oil (VM-4) | 58. | 623. | Sidorov, Petrova, et al., 1972 | |
Capillary | Vacuum Grease Oil (VM-4) | 68. | 624. | Sidorov, Petrova, et al., 1972 | |
Capillary | Squalane | 70. | 625.8 | Dimov and Schopov, 1971 | Column length: 100. m; Column diameter: 0.25 mm |
Packed | SE-30 | 80. | 622. | Mitra and Saha, 1970 | N2 |
Packed | Squalane | 25. | 625. | Mitra and Saha, 1970 | N2 |
Packed | Squalane | 80. | 626. | Mitra and Saha, 1970 | N2 |
Capillary | Squalane | 40. | 626. | Matukuma, 1969 | N2; Column length: 91.4 m; Column diameter: 0.25 mm |
Capillary | Squalane | 40. | 673. | Matukuma, 1969 | N2; Column length: 91.4 m; Column diameter: 0.25 mm |
Packed | Squalane | 27. | 624. | Hively and Hinton, 1968 | He, Chromosorb P; Column length: 15. m; Column diameter: 0.25 mm |
Packed | Squalane | 49. | 626. | Hively and Hinton, 1968 | He, Chromosorb P; Column length: 15. m; Column diameter: 0.25 mm |
Packed | Squalane | 67. | 627. | Hively and Hinton, 1968 | He, Chromosorb P; Column length: 15. m; Column diameter: 0.25 mm |
Packed | Squalane | 86. | 628. | Hively and Hinton, 1968 | He, Chromosorb P; Column length: 15. m; Column diameter: 0.25 mm |
Packed | Squalane | 30. | 624.5 | Tourres, 1967 | H2; Column length: 10. m |
Packed | Squalane | 50. | 626. | Tourres, 1967 | H2; Column length: 10. m |
Capillary | Squalane | 30. | 624. | Tourres, 1967, 2 | H2; Column length: 100. m; Column diameter: 0.25 mm |
Capillary | Squalane | 50. | 625. | Tourres, 1967, 2 | H2; Column length: 100. m; Column diameter: 0.25 mm |
Capillary | Squalane | 70. | 627. | Tourres, 1967, 2 | H2; Column length: 100. m; Column diameter: 0.25 mm |
Packed | Squalane | 30. | 625. | Evans, 1966 | Untreated celite; Column length: 1.8 m |
Packed | Squalane | 40. | 625. | Evans, 1966 | Untreated celite; Column length: 1.8 m |
Packed | Squalane | 55. | 626. | Evans, 1966 | Untreated celite; Column length: 1.8 m |
Packed | Squalane | 70. | 626. | Evans, 1966 | Untreated celite; Column length: 1.8 m |
Packed | Squalane | 26. | 625. | Zulaïca and Guiochon, 1966 | Column length: 10. m |

Kovats' RI, non-polar column, temperature ramp

Column type | Active phase | I | Reference | Comment |
---|---|---|---|---|
Capillary | OV-101 | 618. | Hayes and Pitzer, 1982 | 110. m/0.25 mm/0.20 μm, He, 1. K/min; Tstart: 35. C; Tend: 200. C |
Capillary | Apiezon L | 620. | Louis, 1971 | N2, 1. K/min; Column length: 50. m; Column diameter: 0.25 mm; Tstart: 60. C |

Kovats' RI, non-polar column, custom temperature program

Column type | Active phase | I | Reference | Comment |
---|---|---|---|---|
Capillary | Petrocol DH-100 | 624.25 | Haagen-Smit Laboratory, 1997 | He; Column length: 100. m; Column diameter: 0.2 mm; Program: 5C(10min) => 5C/min => 50C(48min) => 1.5C/min => 195C(91min) |
Capillary | DB-1 | 628. | Hoekman, 1993 | 60. m/0.32 mm/1.0 μm, He; Program: -40 C for 12 min; -40 - 125 C at 3 deg.min; 125-185 C at 6 deg/min; 185 - 220 C at 20 deg/min; hold 220 C for 2 min |

Van Den Dool and Kratz RI, non-polar column, temperature ramp

Column type | Active phase | I | Reference | Comment |
---|---|---|---|---|
Capillary | Petrocol DH | 621.4 | Censullo, Jones, et al., 2003 | 50. m/0.25 mm/0.5 μm, He, 35. C @ 10. min, 3. K/min, 200. C @ 10. min |
Capillary | SPB-1 | 615.96 | LECO Corporation, 2003 | 30. m/0.25 mm/0.25 μm, 40. C @ 2. min, 10. K/min, 250. C @ 2. min |
Capillary | SPB-1 | 616.70 | LECO Corporation, 2003 | 30. m/0.25 mm/0.25 μm, 40. C @ 2. min, 10. K/min, 250. C @ 2. min |
Capillary | DB-5 | 618.2 | Xu, van Stee, et al., 2003 | 30. m/0.25 mm/1. μm, He, 2.5 K/min; Tstart: 50. C; Tend: 200. C |
Capillary | OV-101 | 620.5 | Yin, Liu, et al., 2001 | N2, 1. K/min; Column length: 80. m; Column diameter: 0.22 mm; Tstart: 30. C; Tend: 130. C |
Capillary | Petrocol DH | 618.59 | Subramaniam, Bochniak, et al., 1994 | 100. m/0.25 mm/0.5 μm, He, 1. K/min; Tstart: 30. C; Tend: 220. C |
Capillary | Petrocol DH | 618.60 | Subramaniam, Bochniak, et al., 1994 | 100. m/0.25 mm/0.5 μm, He, 1. K/min; Tstart: 30. C; Tend: 220. C |
Capillary | Petrocol DH | 619. | White, Hackett, et al., 1992 | 100. m/0.25 mm/0.5 μm, He, 1. K/min; Tstart: 30. C; Tend: 220. C |
Capillary | OV-101 | 618. | Hayes and Pitzer, 1981 | 108. m/0.25 mm/0.2 μm, 1. K/min; Tstart: 35. C; Tend: 200. C |

Van Den Dool and Kratz RI, non-polar column, custom temperature program

Column type | Active phase | I | Reference | Comment |
---|---|---|---|---|
Capillary | OV-101 | 620. | Wu and Lu, 1984 | Program: not specified |

Normal alkane RI, non-polar column, isothermal

Column type | Active phase | Temperature (C) | I | Reference | Comment |
---|---|---|---|---|---|
Capillary | OV-101 | 40. | 624. | Li and Deng, 1998 | N2; Column length: 51. m; Column diameter: 0.25 mm |
Capillary | Methyl Silicone | 50. | 626. | N/A | N2; Column length: 74.6 m; Column diameter: 0.28 mm |
Capillary | OV-101 | 50. | 624. | Wu and Lu, 1984, 2 | |
Capillary | OV-101 | 70. | 626. | Wu and Lu, 1984, 2 | |
Capillary | Squalane | 100. | 629. | Dimov N., 1976 | |
Capillary | Squalane | 70. | 627. | Dimov N., 1976 | |
Capillary | Squalane | 60. | 626. | Lehmkuhl, Olbrysch, et al., 1975 | Nitrogen; Column length: 100. m |
Capillary | Squalane | 86. | 619. | Vigdergauz and Martynov, 1971 | He; Column length: 150. m; Column diameter: 0.35 mm |
Capillary | Apiezon L | 40. to 190. | 625. | Mann, Mühlstädt, et al., 1967 | Column length: 2. m |
Packed | Methyl Silicone | 50. | 622. | Huguet, 1961 | Nitrogen, Celite C-22; Column length: 2.5 m |

Normal alkane RI, non-polar column, temperature ramp

Column type | Active phase | I | Reference | Comment |
---|---|---|---|---|
Capillary | Polydimethyl siloxane: CP-Sil 5 CB | 623. | Bramston-Cook, 2013 | 60. m/0.25 mm/1.0 μm, Helium, 45. C @ 1.45 min, 3.6 K/min, 210. C @ 2.72 min |
Capillary | Polydimethyl siloxane: CP-Sil 5 CB | 628. | Bramston-Cook, 2013 | 60. m/0.25 mm/1.0 μm, Helium, 45. C @ 1.45 min, 3.6 K/min, 210. C @ 2.72 min |
Capillary | Petrocol DH | 619. | Supelco, 2012 | 100. m/0.25 mm/0.50 μm, Helium, 20. C @ 15. min, 15. K/min, 220. C @ 30. min |
Capillary | OV-101 | 626. | Orav, Kailas, et al., 1999 | 50. m/0.20 mm/0.50 μm, Helium, 30. C @ 6. min, 1. K/min; Tend: 100. C |
Capillary | DB-1 | 669. | Ciccioli, Cecinato, et al., 1992 | 60. m/0.32 mm/1.2 μm, He, 30. C @ 10. min, 3. K/min; Tend: 240. C |

Normal alkane RI, non-polar column, custom temperature program

Column type | Active phase | I | Reference | Comment |
---|---|---|---|---|
Capillary | Methyl Silicone | 628. | Chen and Feng, 2007 | Program: not specified |
Capillary | Methyl Silicone | 659. | Feng and Mu, 2007 | Program: not specified |
Capillary | OV-101 | 627. | Du and Liang, 2003 | Program: not specified |
Capillary | Polydimethyl siloxane | 626. | Junkes, Castanho, et al., 2003 | Program: not specified |
Capillary | Polydimethyl siloxanes | 620. | Yin, Guo, et al., 2001 | Program: not specified |
Capillary | Methyl Silicone | 627. | Zenkevich and Marinichev, 2001 | Program: not specified |
Capillary | DB-1 | 626. | Zhu and Wang, 2001 | Program: not specified |
Capillary | Methyl Silicone | 623. | Spieksma, 1999 | Program: not specified |
Capillary | OV-101 | 621. | Skrbic and Cvejanov, 1993 | Program: not specified |
Capillary | Squalane | 622. | Petrov, 1984 | Program: not specified |
Capillary | OV-1, SE-30, Methyl silicone, SP-2100, OV-101, DB-1, etc. | 626. | Waggott and Davies, 1984 | Hydrogen; Column length: 50. m; Column diameter: 0.32 mm; Program: not specified |
Packed | SE-30 | 635. | Robinson and Odell, 1971 | N2, Chromosorb W; Column length: 6.1 m; Program: 50C910min) => 20C/min => 90(6min) => 10C/min => 150C(hold) |
Packed | Squalane | 659. | Robinson and Odell, 1971 | N2, Embacel; Column length: 3.0 m; Program: 25C(5min) => 2C/min => 35 => 4C/min => 95C(hold) |
Packed | Squalane | 633. | Robinson and Odell, 1971, 2 | Embacel; Column length: 3.0 m; Program: 25C(5min) => 2C/min(5min) => 4C/min(15min) => (hold at 95C) |

References

Prosen and Rossini, 1945
Prosen, E.J.; Rossini, F.D.,
Heats of combustion and formation of the paraffin hydrocarbons at 25° C,
J. Res. NBS, 1945, 263-267. [all data]
Davies and Gilbert, 1941
Davies, G.F.; Gilbert, E.C.,
Heats of combustion and formation of the nine isomeric heptanes in the liquid state,
J. Am. Chem. Soc., 1941, 63, 2730-2732. [all data]
Huffman H.M., 1961
Huffman H.M.,
Low temperature thermodynamic properties of six isomeric heptanes,
J. Phys. Chem., 1961, 65, 495-503. [all data]
Scott D.W., 1974
Scott D.W.,
Chemical Thermodynamic Properties of Hydrocarbons and Related Substances. Properties of the Alkane Hydrocarbons, C1 through C10 in the Ideal Gas State from 0 to 1500 K. U.S. Bureau of Mines, Bulletin 666, 1974. [all data]
Scott D.W., 1974, 2
Scott D.W.,
Correlation of the chemical thermodynamic properties of alkane hydrocarbons,
J. Chem. Phys., 1974, 60, 3144-3165. [all data]
Huffman, Gross, et al., 1961
Huffman, H.M.; Gross, M.E.; Scott, D.W.; McCullough, I.P.,
Low temperature thermodynamic properties of six isomeric heptanes,
J. Phys. Chem., 1961, 65, 495-503. [all data]
Huffman, Parks, et al., 1930
Huffman, H.M.; Parks, G.S.; Thomas, S.B.,
Thermal data on organic compounds. VIII. The heat capacities, entropies and free energies of the isomeric heptanes,
J. Am. Chem. Soc., 1930, 52, 3241-3251. [all data]
Daubert, 1996
Daubert, T.E.,
Vapor-Liquid Critical Properties of Elements and Compounds. 5. Branched Alkanes and Cycloalkanes,
J. Chem. Eng. Data, 1996, 41, 365-372. [all data]
McMicking and Kay, 1965
McMicking, J.H.; Kay, W.B.,
Vapor Pressures and Saturated Liquid and Vapor Densities of The Isomeric Heptanes and Isomeric Octanes,
Proc., Am. Pet. Inst., Sect. 3, 1965, 45, 75-90. [all data]
Edgar and Calingaert, 1929
Edgar, G.; Calingaert, G.,
Preparation and Properties of the Isomeric Heptanes II. Physical Prop. properties,
J. Am. Chem. Soc., 1929, 51, 1540. [all data]
Majer and Svoboda, 1985
Majer, V.; Svoboda, V.,
Enthalpies of Vaporization of Organic Compounds: A Critical Review and Data Compilation, Blackwell Scientific Publications, Oxford, 1985, 300. [all data]
Svoboda, 1998
Svoboda, V.,
Enthalpies of vaporization, and the cohesive and internal energies of 2,2-dimethylpentane, 2,4-dimethylpentane, 2,2,3-trimethylpentane, 2,3,3-trimethylpentane, and 3-ethylpentane,
The Journal of Chemical Thermodynamics, 1998, 30, 11, 1411-1417, https://doi.org/10.1006/jcht.1998.0414
. [all data]
Osborne and Ginnings, 1947
Osborne, Nathan S.; Ginnings, Defoe C.,
Measurements of heat of vaporization and heat capacity of a number of hydrocarbons,
J. RES. NATL. BUR. STAN., 1947, 39, 5, 453-17, https://doi.org/10.6028/jres.039.031
. [all data]
Osborne and Ginnings, 1947, 2
Osborne, N.S.; Ginnings, D.C.,
Measurements of heat of vaporization and heat capacity of a number of hydrocarbons,
J. Res. NBS, 1947, 39, 453-477. [all data]
Aldrich Chemical Company Inc., 1990
Aldrich Chemical Company Inc.,
Catalog Handbook of Fine Chemicals, Aldrich Chemical Company, Inc., Milwaukee WI, 1990, 1. [all data]
Stephenson and Malanowski, 1987
Stephenson, Richard M.; Malanowski, Stanislaw,
Handbook of the Thermodynamics of Organic Compounds, 1987, https://doi.org/10.1007/978-94-009-3173-2
. [all data]
Forziati, Norris, et al., 1949
Forziati, Alphonse F.; Norris, William R.; Rossini, Frederick D.,
Vapor pressures and boiling points of sixty API-NBS hydrocarbons,
J. RES. NATL. BUR. STAN., 1949, 43, 6, 555-17, https://doi.org/10.6028/jres.043.050
. [all data]
Willingham, Taylor, et al., 1945
Willingham, C.B.; Taylor, W.J.; Pignocco, J.M.; Rossini, F.D.,
Vapor pressures and boiling points of some paraffin, alkylcyclopentane, alkylcyclohexane, and alkylbenzene hydrocarbons,
J. RES. NATL. BUR. STAN., 1945, 35, 3, 219-17, https://doi.org/10.6028/jres.035.009
. [all data]
Williamham, Taylor, et al., 1945
Williamham, C.B.; Taylor, W.J.; Pignocco, J.M.; Rossini, F.D.,
Vapor Pressures and Boiling Points of Some Paraffin, Alkylcyclopentane, Alkylcyclohexane, and Alkylbenzene Hydrocarbons,
J. Res. Natl. Bur. Stand. (U.S.), 1945, 35, 3, 219-244, https://doi.org/10.6028/jres.035.009
. [all data]
Acree, 1991
Acree, William E.,
Thermodynamic properties of organic compounds: enthalpy of fusion and melting point temperature compilation,
Thermochimica Acta, 1991, 189, 1, 37-56, https://doi.org/10.1016/0040-6031(91)87098-H
. [all data]
Rogers and Dejroongruang, 1989
Rogers, D.W.; Dejroongruang, K.,
Enthalpies of hydrogenation of the dimethylpentenes, ethylpentenes, methylbutene, and trimethylbutene,
J. Chem. Thermodyn., 1989, 21, 1115-1120. [all data]
Dolliver, Gresham, et al., 1937
Dolliver, M.a.; Gresham, T.L.; Kistiakowsky, G.B.; Vaughan, W.E.,
Heats of organic reactions. V. Heats of hydrogenation of various hydrocarbons,
J. Am. Chem. Soc., 1937, 59, 831-841. [all data]
Cox and Pilcher, 1970
Cox, J.D.; Pilcher, G.,
Thermochemistry of Organic and Organometallic Compounds, Academic Press, New York, 1970, 1-636. [all data]
Turner, Nettleton, et al., 1958
Turner, R.B.; Nettleton, J.E.; Perelman,
Heats of Hydrogenation. VI. Heats of hydrogenation of some substituted ethylenes,
J. Am. Chem. Soc., 1958, 80, 1430-1433. [all data]
Prosen and Rossini, 1941
Prosen, E.J.R.; Rossini, F.D.,
Heats of isomerization of the nine heptanes,
J. Res. NBS, 1941, 27, 519-528. [all data]
Chen, Liang, et al., 2001
Chen, J.P.; Liang, X.M.; Zhang, Q.; Zhang, L.F.,
Prediction of GC retention values under various column temperature conditions from temperature programmed data,
Chromatographia, 2001, 53, 9/10, 539-547, https://doi.org/10.1007/BF02491619
. [all data]
Dallos, Sisak, et al., 2000
Dallos, A.; Sisak, A.; Kulcsár, Z.; Kováts, E.,
Pair-wise interactions by gas chromatography VII. Interaction free enthalpies of solutes with secondary alcohol groups,
J. Chromatogr. A, 2000, 904, 2, 211-242, https://doi.org/10.1016/S0021-9673(00)00908-0
. [all data]
Heinzen, Soares, et al., 1999
Heinzen, V.E.F.; Soares, M.F.; Yunes, R.A.,
Semi-empirical topological method for the prediction of the chromatographic retention of cis- and trans-alkene isomers and alkanes,
J. Chromatogr. A, 1999, 849, 2, 495-506, https://doi.org/10.1016/S0021-9673(99)00530-0
. [all data]
Skrbic, 1997
Skrbic, B.D.,
Unified retention concept -- statistical treatment of Kováts retention index,
J. Chromatogr. A, 1997, 764, 2, 257-264, https://doi.org/10.1016/S0021-9673(96)00955-7
. [all data]
Zhang and Lu, 1996
Zhang, X.; Lu, P.,
Unified equation between Kováts indices on different stationary phases for select types of compounds,
J. Chromatogr. A, 1996, 731, 1-2, 187-199, https://doi.org/10.1016/0021-9673(95)01213-3
. [all data]
Estel, Mohnke, et al., 1995
Estel, D.; Mohnke; Biermans; Rotzsche,
The analysis of C4-C11 hydrocarbons in naphtha and reformate with a new apolar fused silica column,
J. Hi. Res. Chromatogr., 1995, 18, 7, 403-412, https://doi.org/10.1002/jhrc.1240180703
. [all data]
Krupcik, Skacani, et al., 1994
Krupcik, J.; Skacani, I.; Benicka, E.; Sandra, P.,
Dependence of gas chromatographic retention data of hydrocarbons on the film thickness of the polydimethylsiloxane stationary phase,
Collect. Czech. Chem. Commun., 1994, 59, 11, 2390-2396, https://doi.org/10.1135/cccc19942390
. [all data]
Reddy, Dutoit, et al., 1992
Reddy, K.S.; Dutoit, J.-Cl.; Kovats, E. sz.,
Pair-wise interactions by gas chromatography. I. Interaction free enthalpies of solutes with non-associated primary alcohol groups,
J. Chromatogr., 1992, 609, 1-2, 229-259, https://doi.org/10.1016/0021-9673(92)80167-S
. [all data]
Zhang, Li, et al., 1992
Zhang, M.J.; Li, S.D.; Chen, B.J.,
Compositional studies of high-temperature coal tar by GC/FTIR analysis of light oil fractions,
Chromatographia, 1992, 33, 3/4, 138-146, https://doi.org/10.1007/BF02275894
. [all data]
Dutoit, 1991
Dutoit, J.,
Gas chromatographic retention behaviour of some solutes on structurally similar polar and non-polar stationary phases,
J. Chromatogr., 1991, 555, 1-2, 191-204, https://doi.org/10.1016/S0021-9673(01)87179-X
. [all data]
Guan, Kiraly, et al., 1989
Guan, Y.; Kiraly, J.; Rijks, J.A.,
Interactive retention index database for compound identification in temperature-programmed capillary gas chromatography,
J. Chromatogr., 1989, 472, 129-143, https://doi.org/10.1016/S0021-9673(00)94101-3
. [all data]
Laub and Purnell, 1988
Laub, R.J.; Purnell, J.H.,
Specific retention volumes, retention indices, and family-plot regressions of aliphatic, alicyclic, and aromatic hydrocarbon solutes with OV-101 poly (dimethylsiloxane) stationary phase,
J. Hi. Res. Chromatogr. Chromatogr. Comm., 1988, 11, 9, 649-660, https://doi.org/10.1002/jhrc.1240110908
. [all data]
Lunskii and Paizanskaya, 1988
Lunskii, M.Kh.; Paizanskaya, I.L.,
Identification of hydrocarbons C1-C9 of petrol fractions of oils and condensates in the use of capillary columns with dinonylphthalate,
Zh. Anal. Khim., 1988, 43, 127-135. [all data]
Boneva and Dimov, 1986
Boneva, S.; Dimov, N.,
Unified retention index of hydrocarbons separated on dimethylsilicone OV-101,
Chromatographia, 1986, 21, 12, 697-700, https://doi.org/10.1007/BF02313682
. [all data]
Chien, Furio, et al., 1983
Chien, C.-F.; Furio, D.L.; Kopecni, M.M.; Laub, R.J.,
Specific Retention Volumes and Retention Indices of Selected Hydrocarbon Solutes with OV-101 and SP-2100 Polydimethylsiloxane Solvents,
J. Hi. Res. Chromatogr. Chromatogr. Comm., 1983, 6, 10, 577-580, https://doi.org/10.1002/jhrc.1240061013
. [all data]
Chien, Furio, et al., 1983, 2
Chien, C.-F.; Furio, D.L.; Kopecni, M.M.; Laub, R.J.,
Specific retention volumes and retention indices of selected hydrocarbon solutes with OV-3, OV-7, OV-11, OV-17, OV-22, and OV-25 polymethylphenylsiloxane solvents,
J. Hi. Res. Chromatogr., 1983, 6, 12, 669-679, https://doi.org/10.1002/jhrc.1240061207
. [all data]
Lubeck and Sutton, 1983
Lubeck, A.J.; Sutton, DL.,
Kovats retention indices of selected hydrocarbons through C10 on bonded phase fused silica capillaries,
J. Hi. Res. Chromatogr. Chromatogr. Comm., 1983, 6, 6, 328-332, https://doi.org/10.1002/jhrc.1240060612
. [all data]
Anders, Scheller, et al., 1982
Anders, G.; Scheller, M.; Schuhler, C.; Struppe, H.G.,
Zur Vorausberechnung von Bruttoretentioszeiten bei temperaturprogramierter Gaschromatographie mit Hilfe isotherm bestimmter Retentionsindices und einer Anpassung an experimentelle Retentionszeiten,
Chromatographia, 1982, 15, 1, 43-47, https://doi.org/10.1007/BF02269039
. [all data]
Johansen and Ettre, 1982
Johansen, N.G.; Ettre, L.S.,
Retention index values of hydrocarbons on open-tubular columns coated with methylsilicone liquid phases,
Chromatographia, 1982, 15, 10, 625-630, https://doi.org/10.1007/BF02279488
. [all data]
Chien, Kopecni, et al., 1981
Chien, C.-F.; Kopecni, M.M.; Laub, R.J.,
Specific Retention Volumes and Retention Indices of Selected Hydrocarbon Solutes with OV-1 and SE-30 Polydimethylsiloxane Solvents,
J. Hi. Res. Chromatogr. Chromatogr. Comm., 1981, 4, 10, 539-543, https://doi.org/10.1002/jhrc.1240041017
. [all data]
Mitra, 1981
Mitra, G.D.,
Conversion of linear retention indices into logarithmic retention indices,
J. Chromatogr., 1981, 211, 2, 239-242, https://doi.org/10.1016/S0021-9673(00)88039-5
. [all data]
Nijs and Jacobs, 1981
Nijs, H.H.; Jacobs, P.A.,
On-Line Single Run Analysis of Effluents from a Fischer-Tropsch Reactor,
J. Chromatogr. Sci., 1981, 19, 1, 40-45, https://doi.org/10.1093/chromsci/19.1.40
. [all data]
Castello and D'Amato, 1979
Castello, G.; D'Amato, G.,
Use of Linear and Branched-Chain Paraffinic Liquid Phases as Non-Polar Reference Materials in Gas Chromatography,
J. Chromatogr., 1979, 175, 1, 27-35, https://doi.org/10.1016/S0021-9673(00)86400-6
. [all data]
Dimov and Papazova, 1979
Dimov, N.; Papazova, D.,
Calculation of retention indices of isoparaffins on different phases,
Chromatographia, 1979, 12, 7, 443-447, https://doi.org/10.1007/BF02302987
. [all data]
Chretien and Dubois, 1976
Chretien, J.R.; Dubois, J.-E.,
New Perspectives in the Prediction of Kovats Indices,
J. Chromatogr., 1976, 126, 171-189, https://doi.org/10.1016/S0021-9673(01)84071-1
. [all data]
Riedo, Fritz, et al., 1976
Riedo, F.; Fritz, D.; Tarján, G.; Kováts, E.Sz.,
A tailor-made C87 hydrocarbon as a possible non-polar standard stationary phase for gas chromatography,
J. Chromatogr., 1976, 126, 63-83, https://doi.org/10.1016/S0021-9673(01)84063-2
. [all data]
Rijks, van den Berg, et al., 1974
Rijks, J.A.; van den Berg, J.H.M.; Diependaal, J.P.,
Characterization of hydrocarbons in complex mixtures by two-dimensional precision gas chromatography,
J. Chromatogr., 1974, 91, 603-612, https://doi.org/10.1016/S0021-9673(01)97941-5
. [all data]
Rijks and Cramers, 1974
Rijks, J.A.; Cramers, C.A.,
High precision capillary gas chromatography of hydrocarbons,
Chromatographia, 1974, 7, 3, 99-106, https://doi.org/10.1007/BF02269819
. [all data]
Castello, Berg, et al., 1973
Castello, G.; Berg, M.; Lunardelli, M.,
Temperature dependence of the retention indices of branched-chain paraffins on non-polar stationary phases. A method for its calculation on the basis of molecular structure,
J. Chromatogr., 1973, 79, 23-31, https://doi.org/10.1016/S0021-9673(01)85270-5
. [all data]
Sidorov, Petrova, et al., 1972
Sidorov, R.I.; Petrova, V.I.; Ivanova, M.P.,
Qualitative analysis of wide-boiling fraction C5-C10 with capillary chromatography
in Processes in chromatographic columns. Vol.17, 1972, 14-25. [all data]
Dimov and Schopov, 1971
Dimov, N.; Schopov, D.,
Empirische korrektion der physikalisch-chemischen retentionsindexe von kohlenwasserstoffen auf squalan,
J. Chromatogr., 1971, 63, 223-228, https://doi.org/10.1016/S0021-9673(01)85634-X
. [all data]
Mitra and Saha, 1970
Mitra, G.D.; Saha, N.C.,
Determination of Retention Indices of Saturated Hydrocarbons by Graphical Methods,
J. Chromatogr. Sci., 1970, 8, 2, 95-102, https://doi.org/10.1093/chromsci/8.2.95
. [all data]
Matukuma, 1969
Matukuma, A.,
Retention indices of alkanes through C10 and alkenes through C8 and relation between boiling points and retention data,
Gas Chromatogr., Int. Symp. Anal. Instrum. Div Instrum Soc. Amer., 1969, 7, 55-75. [all data]
Hively and Hinton, 1968
Hively, R.A.; Hinton, R.E.,
Variation of the retention index with temperature on squalane substrates,
J. Gas Chromatogr., 1968, 6, 4, 203-217, https://doi.org/10.1093/chromsci/6.4.203
. [all data]
Tourres, 1967
Tourres, D.A.,
Structural analysis of industrial butene dimers by gas chromatography,
J. Gas Chromatogr., 1967, 5, 1, 35-40, https://doi.org/10.1093/chromsci/5.1.35
. [all data]
Tourres, 1967, 2
Tourres, D.A.,
Structure moléculaire et rétention en chromatographie en phase gazeuse. Influence de la température sur l'indice de rétention d'alcanes isomères,
J. Chromatogr., 1967, 30, 357-377, https://doi.org/10.1016/S0021-9673(00)84168-0
. [all data]
Evans, 1966
Evans, M.B.,
Retention indices of solutes on squalane, dinonyl phthalate, and polyethylene glycol 400,
J. Gas Chromatogr., 1966, 4, 1, 1-3, https://doi.org/10.1093/chromsci/4.1.1
. [all data]
Zulaïca and Guiochon, 1966
Zulaïca, J.; Guiochon, G.,
Analyse des hauts polymères par chromatographie en phase gazeuse de leurs produits de pyrolyse. II. Application à quelques hydrocarbures macromoléculaires purs,
Bull. Soc. Chim. Fr., 1966, 4, 1351-1363. [all data]
Hayes and Pitzer, 1982
Hayes, P.C., Jr.; Pitzer, E.W.,
Characterizing petroleum- and shale-derived jet fuel distillates via temperature-programmed Kováts indices,
J. Chromatogr., 1982, 253, 179-198, https://doi.org/10.1016/S0021-9673(01)88376-X
. [all data]
Louis, 1971
Louis, R.,
Kovats-index-tafeln zur gaschromatographischen analyse von kohlenwasserstoffgemischen,
Erdoel Kohle Erdgas Petrochem., 1971, 24, 2, 88-94. [all data]
Haagen-Smit Laboratory, 1997
Haagen-Smit Laboratory,
Procedure for the detailed hydrocarbon analysis of gasolines by single column high efficiency (capillary) column gas chromatography, SOP NO. MLD 118, Revision No. 1.1, California Environmental Protection Agency, Air Resources Board, El Monte, California, 1997, 22. [all data]
Hoekman, 1993
Hoekman, S.K.,
Improved gas chromatography procedure for speciated hydrocarbon measurements of vehicle emissions,
J. Chromatogr., 1993, 639, 2, 239-253, https://doi.org/10.1016/0021-9673(93)80260-F
. [all data]
Censullo, Jones, et al., 2003
Censullo, A.C.; Jones, D.R.; Wills, M.T.,
Speciation of the volatile organic compounds (VOCs) in solventborne aerosol coatings by solid phase microextraction-gas chromatography,
J. Coat. Technol., 2003, 75, 936, 47-53, https://doi.org/10.1007/BF02697922
. [all data]
LECO Corporation, 2003
LECO Corporation,
Determination of hydrocarbon components in petroleum naphthas, 2003, retrieved from http://www.leco.org/customersupport/apps/separationscience/-190.pdf. [all data]
Xu, van Stee, et al., 2003
Xu, X.; van Stee, L.L.P.; Williams, J.; Beens, J.; Adahchour, M.; Vreuls, R.J.J.; Brinkman, U.A.Th.; Lelieveld, J.,
Comprehensive two-dimensional gas chromatography (GC×GC) measurements of volatile organic compounds in the atmosphere,
Atmos. Chem. Phys., 2003, 3, 3, 665-682, https://doi.org/10.5194/acp-3-665-2003
. [all data]
Yin, Liu, et al., 2001
Yin, C.; Liu, W.; Li, Z.; Pan, Z.; Lin, T.; Zhang, M.,
Chemometrics to chemical modeling: structural coding in hydrocarbons and retention indices of gas chromatography,
J. Sep. Sci., 2001, 24, 3, 213-220, https://doi.org/10.1002/1615-9314(20010301)24:3<213::AID-JSSC213>3.0.CO;2-4
. [all data]
Subramaniam, Bochniak, et al., 1994
Subramaniam, B.; Bochniak, D.; Snavely, K.,
Fischer-Tropsch synthesis in supercritical reaction media, Lawrence Department of Chemical and Petroleum Engineering (DOE/PC/92532--T7), United States Department of Energy, Pittsburgh, PA, 1994, 8, retrieved from http://www.NTIS.gov. [all data]
White, Hackett, et al., 1992
White, C.M.; Hackett, J.; Anderson, R.R.; Kail, S.; Spock, P.S.,
Linear temperature programmed retention indices of gasoline range hydrocarbons and chlorinated hydrocarbons on cross-linked polydimethylsiloxane,
J. Hi. Res. Chromatogr., 1992, 15, 2, 105-120, https://doi.org/10.1002/jhrc.1240150211
. [all data]
Hayes and Pitzer, 1981
Hayes, P.C., Jr.; Pitzer, E.W.,
Kovats indices as a tool in characterizing hydrocarbon fuels in temperature programmed glass capillary gas chromatography. Part 1. Qualitative identification, Inhouse rpt. for Air Force Wright Aeronautical Labs., Air Force Wright Aeronautical Labs., Wright-Patterson AFB, Ohio, 1981, 75. [all data]
Wu and Lu, 1984
Wu, J.; Lu, W.,
Hydrocarbon analysis by open-tubular column chromatography with programmed temperature for straight run gasoline,
Anal. Chem., 1984, 12, 7, 572-578. [all data]
Li and Deng, 1998
Li, H.; Deng, C.,
Qualitative analysis of light components of gasoline cracking using Kovats retention indices,
J. Instrumental Analysis, 1998, 17, 1, 67-69. [all data]
Wu and Lu, 1984, 2
Wu, J.; Lu, W.,
Kovats indices of C4-C10 hydrocarbons in apolar quartz capillary OV-101,
Chin. J. Chromatogr., 1984, 1, 1, 11-17. [all data]
Dimov N., 1976
Dimov N.,
Quantitative gas chromatographic analysis and determination of solute properties. An exact equation for the calculation of the retention indices of isoalkanes on Squalane,
J. Chromatogr., 1976, 119, 109-118, https://doi.org/10.1016/S0021-9673(00)86775-8
. [all data]
Lehmkuhl, Olbrysch, et al., 1975
Lehmkuhl, H.; Olbrysch, O.; Reinehr, D.; Schomburg, G.; Henneberg, D.,
Vergleich der Additionsrichtungen von tert.-Butyl und Isopropylverbindungen des Magnesiums, Aluminiums and Lithiums an 1-Alkene,
Liebigs Ann. Chem., 1975, 1975, 1, 145-159, https://doi.org/10.1002/jlac.197519750114
. [all data]
Vigdergauz and Martynov, 1971
Vigdergauz, M.S.; Martynov, A.A.,
Some applications of the gas chromatographic linear retention indices,
Chromatographia, 1971, 4, 10, 463-467, https://doi.org/10.1007/BF02268816
. [all data]
Mann, Mühlstädt, et al., 1967
Mann, G.; Mühlstädt, M.; Braband, J.; Döring, E.,
Konformation und physikalische daten von alkanen und cyclanen. II. Einfach und zweifach verzweigte alkane,
Tetrahedron, 1967, 23, 8, 3393-3401, https://doi.org/10.1016/S0040-4020(01)92305-1
. [all data]
Huguet, 1961
Huguet, M.,
Kovats retention indices in the qualitative analysis of light hydrocarbons by gas chromatography, Journees internationales d'etude des methodes de separation immediate et de chromatographie, 1961, 69. [all data]
Bramston-Cook, 2013
Bramston-Cook, R.,
Kovats indices for C2-C13 hydrocarbons and selected oxygenated/halocarbons with 100 % dimethylpolysiloxane columns, 2013, retrieved from http://lotusinstruments.com/monographs/List .... [all data]
Supelco, 2012
Supelco, CatalogNo. 24160-U,
Petrocol DH Columns. Catalog No. 24160-U, 2012, retrieved from http://www.sigmaaldrich.com/etc/medialib/docs/Supelco/Datasheet/1/w97949.Par.0001.File.tmp/w97949.pdf. [all data]
Orav, Kailas, et al., 1999
Orav, A.; Kailas, T.; Muurisepp, M.; Kann, J.,
Composition of the oil from waste tires. 1. Fraction boiling at yp to 160 0C,
Proc. Estonian Acad. Sci. Chem., 1999, 48, 1, 30-39. [all data]
Ciccioli, Cecinato, et al., 1992
Ciccioli, P.; Cecinato, A.; Brancaleoni, E.; Frattoni, M.; Liberti, A.,
Use of carbon adsorption traps combined with high resolution gas chromatography - mass spectrometry for the analysis of polar and non-polar C4-C14 hydrocarbons involved in photochemical smog formation,
J. Hi. Res. Chromatogr., 1992, 15, 2, 75-84, https://doi.org/10.1002/jhrc.1240150205
. [all data]
Chen and Feng, 2007
Chen, Y.; Feng, C.,
QSPR study on gas chromatography retention index of some organic pollutants,
Comput. Appl. Chem. (China), 2007, 24, 10, 1404-1408. [all data]
Feng and Mu, 2007
Feng, H.; Mu, L.-L.,
Quantitative structure-retention relationships for alkane and its derivatives based on electrotopological state index and molecular shape index,
Chem. Ind. Engineering (Chinese), 2007, 24, 2, 161-168. [all data]
Du and Liang, 2003
Du, Y.; Liang, Y.,
Data mining for seeking accurate quantitative relationship between molecular structure and GC retention indices of alkanes by projection pursuit,
Comput. Biol. Chem., 2003, 27, 3, 339-353, https://doi.org/10.1016/S1476-9271(02)00081-6
. [all data]
Junkes, Castanho, et al., 2003
Junkes, B.S.; Castanho, R.D.M.; Amboni, C.; Yunes, R.A.; Heinzen, V.E.F.,
Semiempirical Topological Index: A Novel Molecular Descriptor for Quantitative Structure-Retention Relationship Studies,
Internet Electronic Journal of Molecular Design, 2003, 2, 1, 33-49. [all data]
Yin, Guo, et al., 2001
Yin, C.; Guo, W.; Lin, T.; Liu, S.; Fu, R.; Pan, Z.; Wang, L.,
Application of wavelet neural network to the prediction of gas chromatographic retention indices of alkanes,
J. Chinese Chem. Soc., 2001, 48, 739-749. [all data]
Zenkevich and Marinichev, 2001
Zenkevich, I.G.; Marinichev, A.N.,
Comparison of Topological and Dynamics Molecular Characteristics for Precalculation of Chromatographic Retention Parameters of Organic Compounds (in Russian),
Zh. Struct. Khim., 2001, 42, 5, 893-902. [all data]
Zhu and Wang, 2001
Zhu, X.; Wang, W.,
The relationship between partition coefficients of hydrocarbons and their retention indices,
Acta Scientific Circumstantiae, 2001, 21, 5, 631-633. [all data]
Spieksma, 1999
Spieksma, W.,
Determination of vapor liquid equilibrium from the Kovats retention index on dimethylsilicone using the Wilson mixing tool,
J. Hi. Res. Chromatogr., 1999, 22, 10, 565-588, https://doi.org/10.1002/(SICI)1521-4168(19991001)22:10<565::AID-JHRC565>3.0.CO;2-2
. [all data]
Skrbic and Cvejanov, 1993
Skrbic, B.D.; Cvejanov, J.Dj.,
Correlation of unified retention indices for OV-101 and squalane,
Chromatographia, 1993, 35, 1/2, 109-110, https://doi.org/10.1007/BF02278566
. [all data]
Petrov, 1984
Petrov, A.A.,
Hydrocarbons of petroleum, Nauka (publishing house), Moscow, 1984, 263. [all data]
Waggott and Davies, 1984
Waggott, A.; Davies, I.W.,
Identification of organic pollutants using linear temperature programmed retention indices (LTPRIs) - Part II, 1984, retrieved from http://dwi.defra.gov.uk/research/completed-research/reports/dwi0383.pdf. [all data]
Robinson and Odell, 1971
Robinson, P.G.; Odell, A.L.,
A system of standard retention indices and its uses. The characterisation of stationary phases and the prediction of retention indices,
J. Chromatogr., 1971, 57, 1-10, https://doi.org/10.1016/0021-9673(71)80001-8
. [all data]
Robinson and Odell, 1971, 2
Robinson, P.G.; Odell, A.L.,
Comparison of isothermal and non-linear temperature programmed gas chromatography. The temperature dependence of the retention indices of a number of hydrocarbons on squalane and SE-30,
J. Chromatogr., 1971, 57, 11-17, https://doi.org/10.1016/0021-9673(71)80002-X
. [all data]