Vitamin E

Normal alkane RI, non-polar column, temperature ramp

Data compiled by: NIST Mass Spectrometry Data Center, William E. Wallace, director

Column type CapillaryCapillary
Active phase DB-5 MSHP-5
Column length (m) 30.30.
Carrier gas HeliumHelium
Substrate
Column diameter (mm) 0.250.25
Phase thickness (μm) 0.250.25
Tstart (C) 70.50.
Tend (C) 290.300.
Heat rate (K/min) 5.3.
Initial hold (min)
Final hold (min) 10.30.
I 3112.3130.
ReferenceStojanovic, RAdulovic, et al., 2011Isidorov, Lech, et al., 2008
Comment MSDC-RI MSDC-RI

References

Stojanovic, RAdulovic, et al., 2011
Stojanovic, I.Z.; RAdulovic, N.S.; Mitrovic, Y.L.J.; Stamenkovic, S.M.; Stojanovic, G.S., Volatile constituents of selected Parmeliaceae lichens, J. Serb. Chem. Soc., 2011, 76, 7, 987-994, https://doi.org/10.2298/JSC101004087S . [all data]

Isidorov, Lech, et al., 2008
Isidorov, V.A.; Lech, P.; Zolciak, A.; Rusak, N.; Szczepaniak, L., Gas Chromatographic - nass spectrometric investigation of metabolites from the needles and roots of pine seedlings at early stages of pathogenic fungi Armillaria ostoyae attack, Trees, 2008, 22, 4, 531-542, https://doi.org/10.1007/s00468-008-0213-z . [all data]