Methane, trifluoroiodo- anion

Gas phase thermochemistry data

Data compiled by: John E. Bartmess

Quantity Value Units Method Reference Comment
Δfgas-738. ± 19.kJ/molR-EACompton, Reinhardt, et al., 1978

References

Compton, Reinhardt, et al., 1978
Compton, R.N.; Reinhardt, P.W.; Cooper, C.D., Collisional ionization between alkali atoms and some methane derivatives: Electron affinities for CH3NO2, CF3I, and CF3Br, J. Chem. Phys., 1978, 68, 4360. [all data]