α-Tocopheryl acetate

Condensed phase thermochemistry data

Data compiled as indicated in comments:
ALS - Hussein Y. Afeefy, Joel F. Liebman, and Stephen E. Stein
DH - Eugene S. Domalski and Elizabeth D. Hearing

Quantity Value Units Method Reference Comment
Δfliquid-261.7 ± 1.8kcal/molCcbGerasimov, Gubareva, et al., 1985ALS
Quantity Value Units Method Reference Comment
Δcliquid-4430.1 ± 1.8kcal/molCcbGerasimov, Gubareva, et al., 1985Corresponding Δfliquid = -261.66 kcal/mol (simple calculation by NIST; no Washburn corrections); ALS

Constant pressure heat capacity of solid

Cp,solid (cal/mol*K) Temperature (K) Reference Comment
215.293.75Baglay, Gurariy, et al., 1988T = 273 to 334 K. Unsmoothed experimental datum.; DH

Phase change data

Data compiled by: William E. Acree, Jr., James S. Chickos

Enthalpy of vaporization

ΔvapH (kcal/mol) Temperature (K) Reference Comment
14.4 ± 0.31496.Baglay, Gurariy, et al., 1988Based on data from 466. - 524. K.

Van Den Dool and Kratz RI, non-polar column, temperature ramp

View large format table.

Column type Active phase I Reference Comment
CapillaryUltra-13131.Tokuda, Saitoh, et al., 198812.5 m/0.20 mm/0.11 μm, He, 5. K/min, 325. C @ 5. min; Tstart: 120. C
CapillaryUltra-13132.Tokuda, Saitoh, et al., 198812.5 m/0.20 mm/0.11 μm, He, 5. K/min, 325. C @ 5. min; Tstart: 120. C

References

Gerasimov, Gubareva, et al., 1985
Gerasimov, P.A.; Gubareva, A.I.; Blokh, E.L.; Cherkasova, T.G., Physicochemical properties of α-tocopherol acetate, Khim.-Farm. Zh., 1985, 19, 1274-1276. [all data]

Baglay, Gurariy, et al., 1988
Baglay, A.K.; Gurariy, L.L.; Kuleshov, G.G., Physical properties of compounds used in vitamin synthesis, J. Chem. Eng. Data, 1988, 33, 512-518. [all data]