2,4,6-tri-sec-butylphenol

Reaction thermochemistry data

Data compiled by: Hussein Y. Afeefy, Joel F. Liebman, and Stephen E. Stein

Individual Reactions

Phenol + C18H30O = Phenol, 2,4-bis(1-methylpropyl)- + Phenol, 2-(1-methylpropyl)-

By formula: C6H6O + C18H30O = C14H22O + C10H14O

Quantity Value Units Method Reference Comment
Δr-0.41 ± 0.36kcal/molEqkNesterova, Pimerzin, et al., 1989liquid phase; Isomerization

References

Nesterova, Pimerzin, et al., 1989
Nesterova, T.N.; Pimerzin, A.A.; Rozhnov, A.M.; Karlina, T.N., Equilibria for the isomerization of (secondary-alkyl)phenols and cyclohexylphenols, J. Chem. Thermodyn., 1989, 21, 385-395. [all data]