Phenol, 2,3,4,6-tetrachloro-

Phase change data

Data compiled as indicated in comments:
BS - Robert L. Brown and Stephen E. Stein
TRC - Thermodynamics Research Center, NIST Boulder Laboratories, Chris Muzny director
AC - William E. Acree, Jr., James S. Chickos

Quantity Value Units Method Reference Comment
Tfus341.KN/AGalat, 1952Uncertainty assigned by TRC = 4. K; TRC

Reduced pressure boiling point

Tboil (K) Pressure (atm) Reference Comment
423.20.020Weast and Grasselli, 1989BS

Enthalpy of vaporization

ΔvapH (kcal/mol) Temperature (K) Method Reference Comment
15.5388.AStephenson and Malanowski, 1987Based on data from 373. - 548. K. See also Stull, 1947.; AC

Antoine Equation Parameters

log10(P) = A − (B / (T + C))
    P = vapor pressure (atm)
    T = temperature (K)

View plot Requires a JavaScript / HTML 5 canvas capable browser.

Temperature (K) A B C Reference Comment
373. - 548.5.520162822.636-37.044Stull, 1947Coefficents calculated by NIST from author's data.

In addition to the Thermodynamics Research Center (TRC) data available from this site, much more physical and chemical property data is available from the following TRC products:

Lee's RI, non-polar column, temperature ramp

Data compiled by: NIST Mass Spectrometry Data Center, William E. Wallace, director

Column type CapillaryCapillaryCapillaryCapillary
Active phase DB-5MSDB-5MSDB-5DB-5
Column length (m) 30.30.30.30.
Carrier gas   HeHelium
Substrate
Column diameter (mm) 0.250.250.320.32
Phase thickness (μm) 0.50.5
Tstart (C) 40.40.80.90.
Tend (C) 310.310.300.250.
Heat rate (K/min) 10.4.3.4.
Initial hold (min) 1.1.1.
Final hold (min)   10.
I 264.80265.40296.864298.6
ReferenceChen, Keeran, et al., 2002Chen, Keeran, et al., 2002Tong, Shore, et al., 1984Viau, Studak, et al., 1984
Comment MSDC-RI MSDC-RI MSDC-RI MSDC-RI

Van Den Dool and Kratz RI, non-polar column, temperature ramp

Data compiled by: NIST Mass Spectrometry Data Center, William E. Wallace, director

Column type CapillaryCapillaryCapillary
Active phase SE-30SE-30SE-30
Column length (m)
Carrier gas
Substrate
Column diameter (mm)
Phase thickness (μm)
Tstart (C) 100.100.100.
Tend (C)
Heat rate (K/min) 10.2.6.
Initial hold (min)
Final hold (min)
I 1552.1523.1546.
ReferenceKorhonen, 1984Korhonen, 1984Korhonen, 1984
Comment MSDC-RI MSDC-RI MSDC-RI

References

Galat, 1952
Galat, A., The Preparation of 2,3,5-Trichlorophenoxyacetic acid (2,4,5-T), J. Am. Chem. Soc., 1952, 74, 3890-1. [all data]

Weast and Grasselli, 1989
CRC Handbook of Data on Organic Compounds, 2nd Editon, Weast,R.C and Grasselli, J.G., ed(s)., CRC Press, Inc., Boca Raton, FL, 1989, 1. [all data]

Stephenson and Malanowski, 1987
Stephenson, Richard M.; Malanowski, Stanislaw, Handbook of the Thermodynamics of Organic Compounds, 1987, https://doi.org/10.1007/978-94-009-3173-2 . [all data]

Stull, 1947
Stull, Daniel R., Vapor Pressure of Pure Substances. Organic and Inorganic Compounds, Ind. Eng. Chem., 1947, 39, 4, 517-540, https://doi.org/10.1021/ie50448a022 . [all data]

Jondorf and Williams, 1958
Jondorf, W.R.; Williams, R.T., Biochem. J., 1958, 69, 181. [all data]