CAS Reg. No. 58799-98-7

Reaction thermochemistry data

Data compiled by: John E. Bartmess

Individual Reactions

(CAS Reg. No. 58799-98-7 • 4294967295sodium) + sodium = CAS Reg. No. 58799-98-7

By formula: (CAS Reg. No. 58799-98-7 • 4294967295Na) + Na = CAS Reg. No. 58799-98-7

Quantity Value Units Method Reference Comment
Δr58.7 ± 3.0kJ/molN/AMcHugh, Eaton, et al., 1989gas phase; Vertical Detachment Energy: 0.543±0.010 eV

References

McHugh, Eaton, et al., 1989
McHugh, K.M.; Eaton, J.G.; Lee, G.H.; Sarkas, H.W.; Kidder, L.H.; Snodgrass, J.T.; Manaa, M.R.; Bowen, K.H., Photoelectron Spectra of the alkali metal cluster Anions: Na-,n=2-5, K-,n=2-7, Rb-,n=2-3, and Cs-,n=2-3, J. Chem. Phys., 1989, 91, 6, 3792, https://doi.org/10.1063/1.456861 . [all data]