Anthracene, 1,2-dihydro-

Gas phase thermochemistry data

Data compiled by: Glushko Thermocenter, Russian Academy of Sciences, Moscow

Constant pressure heat capacity of gas

Cp,gas (cal/mol*K) Temperature (K) Reference Comment
10.5150.Dorofeeva O.V., 1988Recommended values were calculated statistically mechanically using force field approximation for polycyclic aromatic hydrocarbons to estimate the needed vibrational frequencies (see also [ Dorofeeva O.V., 1986]). These functions are reproduced in the reference book [ Frenkel M., 1994].
15.82100.
22.23150.
29.587200.
41.558273.15
45.77 ± 0.60298.15
46.083300.
62.180400.
75.896500.
87.029600.
96.035700.
103.40800.
109.51900.
114.611000.
118.921100.
122.571200.
125.681300.
128.351400.
130.651500.

Kovats' RI, non-polar column, isothermal

View large format table.

Column type Active phase Temperature (C) I Reference Comment
PackedOV-1150.1700.Brooks, Cole, et al., 1982Helium or Nitrogen, Gas-Chrom Q (100-120 mesh); Column length: 1.8 m; Column diameter: 0.25 mm

Lee's RI, non-polar column, custom temperature program

View large format table.

Column type Active phase I Reference Comment
CapillaryHP-5MS287.50Cheng, Liu, et al., 200530. m/0.30 mm/0.25 μm, He; Program: 50 0C (2 min) 8 0C/min -> 120 0C (3 min) 10 0C/min -> 230 0C

References

Dorofeeva O.V., 1988
Dorofeeva O.V., Thermodynamic Properties of Polycyclic Aromatic Hydrocarbons in the Gaseous Phase. Institute for High Temperatures, USSR Academy of Sciences, Preprint No.1-238 (in Russian), Moscow, 1988. [all data]

Dorofeeva O.V., 1986
Dorofeeva O.V., On calculation of thermodynamic properties of polycyclic aromatic hydrocarbons, Thermochim. Acta, 1986, 102, 59-66. [all data]

Frenkel M., 1994
Frenkel M., Thermodynamics of Organic Compounds in the Gas State, Vol. I, II, Thermodynamics Research Center, College Station, Texas, 1994, 1994. [all data]

Brooks, Cole, et al., 1982
Brooks, C.J.W.; Cole, W.J.; Borthwick, J.H.; Brown, G.M., Characterization of Dihydroarenediols and Related Compounds by Gas Chromatography-Mass Spectrometry: Comparison of Derivatives, J. Chromatogr., 1982, 239, 191-216, https://doi.org/10.1016/S0021-9673(00)81980-9 . [all data]

Cheng, Liu, et al., 2005
Cheng, D.-X.; Liu, B.-X.; Sun, Y.-A.; Xie, B.; Zhang, H.-L., rapid analysis of pyrolysis products of cholesterol by GC-MS assited with boiling point - Lee retention index, journal of Instrumental Analysis - Fenxi ceshi xuebao, 2005, 24, 6, 85-88. [all data]