Papaverine

Van Den Dool and Kratz RI, non-polar column, temperature ramp

Data compiled by: NIST Mass Spectrometry Data Center, William E. Wallace, director

Column type CapillaryPacked
Active phase SPB-1SE-30
Column length (m) 30.1.8
Carrier gas HeN2
Substrate  Chromosorb W
Column diameter (mm) 0.75
Phase thickness (μm) 1.0
Tstart (C) 160.130.
Tend (C) 280.290.
Heat rate (K/min) 10.8.
Initial hold (min)  2.
Final hold (min) 12.8.
I 2824.2800.
ReferenceChrist, Noomano, et al., 1988Perrigo and Peel, 1981
Comment MSDC-RI MSDC-RI

Normal alkane RI, non-polar column, custom temperature program

Data compiled by: NIST Mass Spectrometry Data Center, William E. Wallace, director

Column type CapillaryCapillaryOtherOther
Active phase HP-1Polymethylsiloxane, (PMS-20000)Methyl SiliconeMethyl Silicone
Column length (m)  12.
Carrier gas HeliumHe
Substrate
Column diameter (mm)  0.20
Phase thickness (μm)  0.33
Program not specifiednot specifiednot specifiednot specified
I 2820.2813.2825.2770.
ReferenceGrigor'ev, Bozhko, et al., 2009Gambaro, Saligari, et al., 1997Ardrey and Moffat, 1981Ardrey and Moffat, 1981
Comment MSDC-RI MSDC-RI MSDC-RI MSDC-RI

Kovats' RI, non-polar column, temperature ramp

Data compiled by: NIST Mass Spectrometry Data Center, William E. Wallace, director

Column type Capillary
Active phase SE-30
Column length (m) 25.
Carrier gas
Substrate
Column diameter (mm) 0.49
Phase thickness (μm) 1.14
Tstart (C) 100.
Tend (C) 275.
Heat rate (K/min) 8.
Initial hold (min) 2.
Final hold (min) 15.
I 2815.
ReferenceSchepers, Wijsbeek, et al., 1982
Comment MSDC-RI

References

Christ, Noomano, et al., 1988
Christ, D.W.; Noomano, P.; Rosas, M.; Rhone, D., Retention indices by wide-bore capillary gas chromatography with nitrogen-phosphorus detection, J. Anal. Toxicol., 1988, 12, 2, 84-88, https://doi.org/10.1093/jat/12.2.84 . [all data]

Perrigo and Peel, 1981
Perrigo, B.J.; Peel, H.W., The use of retention indices and temperature-programmed gas chromatography in analytical toxicology, J. Chromatogr. Sci., 1981, 19, 5, 219-226, https://doi.org/10.1093/chromsci/19.5.219 . [all data]